BDBM4058 2-Amino-6-(2,6-dichlorophenyl)-8-(pyridin-4-ylmethyl)-8H-pyrido[2,3-d]pyrimidin-7-one::2-amino-6-(2,6-dichlorophenyl)-8-(pyridin-4-ylmethyl)-7H,8H-pyrido[2,3-d]pyrimidin-7-one::pyrido[2,3-d]pyrimidin-7-one deriv. 13
SMILES: Nc1ncc2cc(-c3c(Cl)cccc3Cl)c(=O)n(Cc3ccncc3)c2n1
InChI Key: InChIKey=XMTYXUJCIGTOHH-UHFFFAOYSA-N
Data: 3 IC50
Activity Spreadsheet -- Enzyme Inhibition Constant Data from BindingDB
Found 3 hits for monomerid = 4058
Trg + Lig
Ki
nM
ΔG°
kcal/mole
IC50
nM
Kd
nM
EC50/IC50
nM
koff
s-1
kon
M-1s-1
pHTemp
°C
Platelet-derived growth factor receptor beta
(Homo sapiens (Human))
BDBM4058
(2-Amino-6-(2,6-dichlorophenyl)-8-(pyridin-4-ylmeth...)
Show SMILES Nc1ncc2cc(-c3c(Cl)cccc3Cl)c(=O)n(Cc3ccncc3)c2n1 |(-6.98,-1.25,;-5.65,-.48,;-5.65,1.06,;-4.32,1.83,;-2.98,1.06,;-1.65,1.83,;-.32,1.06,;1.02,1.83,;1.02,3.37,;-.32,4.14,;2.35,4.14,;3.69,3.37,;3.69,1.83,;2.35,1.06,;2.35,-.48,;-.32,-.48,;1.02,-1.25,;-1.65,-1.25,;-1.65,-2.79,;-.32,-3.56,;-.32,-5.1,;1.02,-5.87,;2.35,-5.1,;2.35,-3.56,;1.02,-2.79,;-2.98,-.48,;-4.32,-1.25,)|
Show InChI InChI=1S/C19H13Cl2N5O/c20-14-2-1-3-15(21)16(14)13-8-12-9-24-19(22)25-17(12)26(18(13)27)10-11-4-6-23-7-5-11/h1-9H,10H2,(H2,22,24,25)
NCI pathway
Reactome pathway
n/an/a 1.20E+3n/an/an/an/an/an/a
Parke-Davis Pharmaceutical Research
Assay Description
IC50 is the inhibitor concentration which inhibits 50% of kinase activity that catalyzes the transfer of the terminal phosphate from [gamma-32P] labe...
J Med Chem 41: 4365-77 (1998)
Article DOI: 10.1021/jm980398y
BindingDB Entry DOI: 10.7270/Q2CC0XWN
Proto-oncogene tyrosine-protein kinase Src
(Homo sapiens (Human))
BDBM4058
(2-Amino-6-(2,6-dichlorophenyl)-8-(pyridin-4-ylmeth...)
Show SMILES Nc1ncc2cc(-c3c(Cl)cccc3Cl)c(=O)n(Cc3ccncc3)c2n1 |(-6.98,-1.25,;-5.65,-.48,;-5.65,1.06,;-4.32,1.83,;-2.98,1.06,;-1.65,1.83,;-.32,1.06,;1.02,1.83,;1.02,3.37,;-.32,4.14,;2.35,4.14,;3.69,3.37,;3.69,1.83,;2.35,1.06,;2.35,-.48,;-.32,-.48,;1.02,-1.25,;-1.65,-1.25,;-1.65,-2.79,;-.32,-3.56,;-.32,-5.1,;1.02,-5.87,;2.35,-5.1,;2.35,-3.56,;1.02,-2.79,;-2.98,-.48,;-4.32,-1.25,)|
Show InChI InChI=1S/C19H13Cl2N5O/c20-14-2-1-3-15(21)16(14)13-8-12-9-24-19(22)25-17(12)26(18(13)27)10-11-4-6-23-7-5-11/h1-9H,10H2,(H2,22,24,25)
n/an/a 630n/an/an/an/an/an/a
Parke-Davis Pharmaceutical Research
Assay Description
IC50 is the inhibitor concentration which inhibits 50% of kinase activity that catalyzes the transfer of the terminal phosphate from [gamma-32P] labe...
J Med Chem 41: 4365-77 (1998)
Article DOI: 10.1021/jm980398y
BindingDB Entry DOI: 10.7270/Q2CC0XWN
Fibroblast growth factor receptor 1
(Homo sapiens (Human))
BDBM4058
(2-Amino-6-(2,6-dichlorophenyl)-8-(pyridin-4-ylmeth...)
Show SMILES Nc1ncc2cc(-c3c(Cl)cccc3Cl)c(=O)n(Cc3ccncc3)c2n1 |(-6.98,-1.25,;-5.65,-.48,;-5.65,1.06,;-4.32,1.83,;-2.98,1.06,;-1.65,1.83,;-.32,1.06,;1.02,1.83,;1.02,3.37,;-.32,4.14,;2.35,4.14,;3.69,3.37,;3.69,1.83,;2.35,1.06,;2.35,-.48,;-.32,-.48,;1.02,-1.25,;-1.65,-1.25,;-1.65,-2.79,;-.32,-3.56,;-.32,-5.1,;1.02,-5.87,;2.35,-5.1,;2.35,-3.56,;1.02,-2.79,;-2.98,-.48,;-4.32,-1.25,)|
Show InChI InChI=1S/C19H13Cl2N5O/c20-14-2-1-3-15(21)16(14)13-8-12-9-24-19(22)25-17(12)26(18(13)27)10-11-4-6-23-7-5-11/h1-9H,10H2,(H2,22,24,25)
NCI pathway
Reactome pathway
n/an/a 720n/an/an/an/an/an/a
Parke-Davis Pharmaceutical Research
Assay Description
IC50 is the inhibitor concentration which inhibits 50% of kinase activity that catalyzes the transfer of the terminal phosphate from [gamma-32P] labe...
J Med Chem 41: 4365-77 (1998)
Article DOI: 10.1021/jm980398y
BindingDB Entry DOI: 10.7270/Q2CC0XWN