BDBM4076 8-Ethyl-6-phenyl-2-(pyridin-4-ylamino)-8H-pyrido[2,3-d]pyrimidin-7-one::8-ethyl-6-phenyl-2-(pyridin-4-ylamino)-7H,8H-pyrido[2,3-d]pyrimidin-7-one::pyrido[2,3-d]pyrimidin-7-one deriv. 53
SMILES: CCn1c2nc(Nc3ccncc3)ncc2cc(-c2ccccc2)c1=O
InChI Key: InChIKey=JMCKXGDSYVEIDE-UHFFFAOYSA-N
Data: 3 IC50
Activity Spreadsheet -- Enzyme Inhibition Constant Data from BindingDB
Found 3 hits for monomerid = 4076
Trg + Lig
Ki
nM
ΔG°
kcal/mole
IC50
nM
Kd
nM
EC50/IC50
nM
koff
s-1
kon
M-1s-1
pHTemp
°C
Platelet-derived growth factor receptor beta
(Homo sapiens (Human))
BDBM4076
(8-Ethyl-6-phenyl-2-(pyridin-4-ylamino)-8H-pyrido[2...)
Show SMILES CCn1c2nc(Nc3ccncc3)ncc2cc(-c2ccccc2)c1=O
Show InChI InChI=1S/C20H17N5O/c1-2-25-18-15(12-17(19(25)26)14-6-4-3-5-7-14)13-22-20(24-18)23-16-8-10-21-11-9-16/h3-13H,2H2,1H3,(H,21,22,23,24)
NCI pathway
Reactome pathway
n/an/a 74n/an/an/an/an/an/a
Parke-Davis Pharmaceutical Research
Assay Description
IC50 is the inhibitor concentration which inhibits 50% of kinase activity that catalyzes the transfer of the terminal phosphate from [gamma-32P] labe...
J Med Chem 41: 4365-77 (1998)
Article DOI: 10.1021/jm980398y
BindingDB Entry DOI: 10.7270/Q2CC0XWN
Proto-oncogene tyrosine-protein kinase Src
(Homo sapiens (Human))
BDBM4076
(8-Ethyl-6-phenyl-2-(pyridin-4-ylamino)-8H-pyrido[2...)
Show SMILES CCn1c2nc(Nc3ccncc3)ncc2cc(-c2ccccc2)c1=O
Show InChI InChI=1S/C20H17N5O/c1-2-25-18-15(12-17(19(25)26)14-6-4-3-5-7-14)13-22-20(24-18)23-16-8-10-21-11-9-16/h3-13H,2H2,1H3,(H,21,22,23,24)
n/an/a 410n/an/an/an/an/an/a
Parke-Davis Pharmaceutical Research
Assay Description
IC50 is the inhibitor concentration which inhibits 50% of kinase activity that catalyzes the transfer of the terminal phosphate from [gamma-32P] labe...
J Med Chem 41: 4365-77 (1998)
Article DOI: 10.1021/jm980398y
BindingDB Entry DOI: 10.7270/Q2CC0XWN
Fibroblast growth factor receptor 1
(Homo sapiens (Human))
BDBM4076
(8-Ethyl-6-phenyl-2-(pyridin-4-ylamino)-8H-pyrido[2...)
Show SMILES CCn1c2nc(Nc3ccncc3)ncc2cc(-c2ccccc2)c1=O
Show InChI InChI=1S/C20H17N5O/c1-2-25-18-15(12-17(19(25)26)14-6-4-3-5-7-14)13-22-20(24-18)23-16-8-10-21-11-9-16/h3-13H,2H2,1H3,(H,21,22,23,24)
NCI pathway
Reactome pathway
n/an/a 1.10E+3n/an/an/an/an/an/a
Parke-Davis Pharmaceutical Research
Assay Description
IC50 is the inhibitor concentration which inhibits 50% of kinase activity that catalyzes the transfer of the terminal phosphate from [gamma-32P] labe...
J Med Chem 41: 4365-77 (1998)
Article DOI: 10.1021/jm980398y
BindingDB Entry DOI: 10.7270/Q2CC0XWN