BDBM40799 2-Methyl-2H-pyrazole-3-carboxylic acid (1,3,5-trimethyl-1H-pyrazol-4-yl)-amide::2-methyl-N-(1,3,5-trimethyl-4-pyrazolyl)-3-pyrazolecarboxamide::2-methyl-N-(1,3,5-trimethylpyrazol-4-yl)pyrazole-3-carboxamide::MLS000035911::SMR000009246::cid_652342
SMILES: Cc1nn(C)c(C)c1NC(=O)c1ccnn1C
InChI Key: InChIKey=FYAIGCZBRGMVDP-UHFFFAOYSA-N
Data: 1 IC50
Activity Spreadsheet -- Enzyme Inhibition Constant Data from BindingDB
Found 1 hit for monomerid = 40799
Trg + Lig
Ki
nM
ΔG°
kcal/mole
IC50
nM
Kd
nM
EC50/IC50
nM
koff
s-1
kon
M-1s-1
pHTemp
°C
Complement C1s
(Homo sapiens (Human))
BDBM40799
(2-Methyl-2H-pyrazole-3-carboxylic acid (1,3,5-trim...)
Show SMILES Cc1nn(C)c(C)c1NC(=O)c1ccnn1C
Show InChI InChI=1S/C11H15N5O/c1-7-10(8(2)15(3)14-7)13-11(17)9-5-6-12-16(9)4/h5-6H,1-4H3,(H,13,17)
Reactome pathway
PCBioAssay
n/an/a>5.00E+4n/an/an/an/an/an/a
PCMD
Curated by PubChem BioAssay
Assay Description
Molecular Library Screening Center Network (MLSCN) Penn Center for Molecular Discovery (PCMD) Assay Provider: Dr. Scott L. Diamond, University of Pen...
PubChem Bioassay (2008)
BindingDB Entry DOI: 10.7270/Q2MP51PC