null
SMILES: CC(C)c1nc(SCC(=O)Nc2cc(C)on2)c2ccccc2n1
InChI Key: InChIKey=MGDZMXRQAZCEAN-UHFFFAOYSA-N
Activity Spreadsheet -- Enzyme Inhibition Constant Data from BindingDB
Found 3 hits for monomerid = 41001
Trg + Lig
Ki
nM
ΔG°
kcal/mole
IC50
nM
Kd
nM
EC50/IC50
nM
koff
s-1
kon
M-1s-1
pHTemp
°C
Focal adhesion kinase 1
(Homo sapiens (Human))
BDBM41001
(2-(2-Isopropyl-quinazolin-4-ylsulfanyl)-N-(5-methy...)
Show SMILES CC(C)c1nc(SCC(=O)Nc2cc(C)on2)c2ccccc2n1
Show InChI InChI=1S/C17H18N4O2S/c1-10(2)16-18-13-7-5-4-6-12(13)17(20-16)24-9-15(22)19-14-8-11(3)23-21-14/h4-8,10H,9H2,1-3H3,(H,19,21,22)
NCI pathway
Reactome pathway
PCBioAssay
n/an/a 1.74E+4n/an/an/an/an/an/a
The Scripps Research Institute Molecular Screening Center
Curated by PubChem BioAssay
Assay Description
Source (MLSCN Center Name): The Scripps Research Institute Molecular Screening Center Center Affiliation: The Scripps Research Institute, TSRI Assa...
PubChem Bioassay (2007)
BindingDB Entry DOI: 10.7270/Q2GX48ZN
Major prion protein
(Homo sapiens (Human))
BDBM41001
(2-(2-Isopropyl-quinazolin-4-ylsulfanyl)-N-(5-methy...)
Show SMILES CC(C)c1nc(SCC(=O)Nc2cc(C)on2)c2ccccc2n1
Show InChI InChI=1S/C17H18N4O2S/c1-10(2)16-18-13-7-5-4-6-12(13)17(20-16)24-9-15(22)19-14-8-11(3)23-21-14/h4-8,10H,9H2,1-3H3,(H,19,21,22)
NCI pathway
Reactome pathway
PCBioAssay
n/an/a 936n/an/an/an/an/an/a
The Scripps Research Institute Molecular Screening Center
Curated by PubChem BioAssay
Assay Description
Source (MLPCN Center Name): The Scripps Research Institute Molecular Screening Center (SRIMSC) Affiliation: The Scripps Research Institute, TSRI Assa...
PubChem Bioassay (2014)
BindingDB Entry DOI: 10.7270/Q2HM573M
Protein-tyrosine kinase 2-beta
(Homo sapiens (Human))
BDBM41001
(2-(2-Isopropyl-quinazolin-4-ylsulfanyl)-N-(5-methy...)
Show SMILES CC(C)c1nc(SCC(=O)Nc2cc(C)on2)c2ccccc2n1
Show InChI InChI=1S/C17H18N4O2S/c1-10(2)16-18-13-7-5-4-6-12(13)17(20-16)24-9-15(22)19-14-8-11(3)23-21-14/h4-8,10H,9H2,1-3H3,(H,19,21,22)
PCBioAssay
n/an/a>6.95E+4n/an/an/an/an/an/a
The Scripps Research Institute Molecular Screening Center
Curated by PubChem BioAssay
Assay Description
Source (MLPCN Center Name): The Scripps Research Institute Molecular Screening Center (SRIMSC) Affiliation: The Scripps Research Institute, TSRI Assa...
PubChem Bioassay (2009)
BindingDB Entry DOI: 10.7270/Q2H993M3