BDBM41194 (1-Methyl-1H-pyrazolo[3,4-d]pyrimidin-4-yl)-naphthalen-2-yl-amine::(1-methylpyrazolo[3,4-d]pyrimidin-4-yl)-(2-naphthyl)amine::1-methyl-N-(2-naphthalenyl)-4-pyrazolo[3,4-d]pyrimidinamine::1-methyl-N-naphthalen-2-yl-pyrazolo[3,4-d]pyrimidin-4-amine::1-methyl-N-naphthalen-2-ylpyrazolo[3,4-d]pyrimidin-4-amine::MLS000071593::SMR000011167::cid_647663
SMILES: Cn1ncc2c(Nc3ccc4ccccc4c3)ncnc12
InChI Key: InChIKey=GZKDFVLASZBIFV-UHFFFAOYSA-N
Data: 1 IC50
Activity Spreadsheet -- Enzyme Inhibition Constant Data from BindingDB
Found 1 hit for monomerid = 41194
Trg + Lig
Ki
nM
ΔG°
kcal/mole
IC50
nM
Kd
nM
EC50/IC50
nM
koff
s-1
kon
M-1s-1
pHTemp
°C
RNA polymerase beta subunit (EC 2.7.7.6)
(Escherichia coli)
BDBM41194
((1-Methyl-1H-pyrazolo[3,4-d]pyrimidin-4-yl)-naphth...)
Show SMILES Cn1ncc2c(Nc3ccc4ccccc4c3)ncnc12
Show InChI InChI=1S/C16H13N5/c1-21-16-14(9-19-21)15(17-10-18-16)20-13-7-6-11-4-2-3-5-12(11)8-13/h2-10H,1H3,(H,17,18,20)
PCBioAssay
n/an/a>5.00E+4n/an/an/an/an/an/a
PCMD
Curated by PubChem BioAssay
Assay Description
Screening Center: Penn Center for Molecular Discovery Center Affiliation: University of Pennsylvania Network: Molecular Library Screening Center Netw...
PubChem Bioassay (2008)
BindingDB Entry DOI: 10.7270/Q23N21T1