null
SMILES: O=C(NCc1nc2ccccc2[nH]1)c1ccco1
InChI Key: InChIKey=WFEIYWNIMQWEHE-UHFFFAOYSA-N
PDB links: 2 PDB IDs match this monomer.
Activity Spreadsheet -- Enzyme Inhibition Constant Data from BindingDB
Found 1 hit for monomerid = 41207
Trg + Lig
Ki
nM
ΔG°
kcal/mole
IC50
nM
Kd
nM
EC50/IC50
nM
koff
s-1
kon
M-1s-1
pHTemp
°C
DNA-directed RNA polymerase subunit beta
(Escherichia coli)
BDBM41207
(MLS000079915 | N-(1H-benzimidazol-2-ylmethyl)-2-fu...)
Show SMILES O=C(NCc1nc2ccccc2[nH]1)c1ccco1
Show InChI InChI=1S/C13H11N3O2/c17-13(11-6-3-7-18-11)14-8-12-15-9-4-1-2-5-10(9)16-12/h1-7H,8H2,(H,14,17)(H,15,16)
PCBioAssay
n/an/a>5.00E+4n/an/an/an/an/an/a
PCMD
Curated by PubChem BioAssay
Assay Description
Screening Center: Penn Center for Molecular Discovery Center Affiliation: University of Pennsylvania Network: Molecular Library Screening Center Netw...
PubChem Bioassay (2008)
BindingDB Entry DOI: 10.7270/Q23N21T1