BDBM4130 (2S,4S)-N-tert-butyl-4-chloro-1-[(2S,3S)-4-(2-fluorophenyl)-2-hydroxy-3-[(3-hydroxy-2-methylphenyl)formamido]butanoyl]pyrrolidine-2-carboxamide::(3-Hydroxy-2-methylbenzoyl)-{2(S)-hydroxy-3(S)-amino-4-(2-fluoro)-phenylbutanoyl}-4(S)-Cl-Pro-NH-t-Bu::AHPBA deriv. 15
SMILES: Cc1c(O)cccc1C(=O)N[C@@H](Cc1ccccc1F)[C@H](O)C(=O)N1C[C@@H](Cl)C[C@H]1C(=O)NC(C)(C)C
InChI Key: InChIKey=JNTLEWGUIHZYBE-GCBQAYLCSA-N
Data: 1 IC50
Activity Spreadsheet -- Enzyme Inhibition Constant Data from BindingDB
Found 1 hit for monomerid = 4130
Trg + Lig
Ki
nM
ΔG°
kcal/mole
IC50
nM
Kd
nM
EC50/IC50
nM
koff
s-1
kon
M-1s-1
pHTemp
°C
HIV-1 Protease
(Human immunodeficiency virus type 1)
BDBM4130
((2S,4S)-N-tert-butyl-4-chloro-1-[(2S,3S)-4-(2-fluo...)
Show SMILES Cc1c(O)cccc1C(=O)N[C@@H](Cc1ccccc1F)[C@H](O)C(=O)N1C[C@@H](Cl)C[C@H]1C(=O)NC(C)(C)C |r|
Show InChI InChI=1S/C27H33ClFN3O5/c1-15-18(9-7-11-22(15)33)24(35)30-20(12-16-8-5-6-10-19(16)29)23(34)26(37)32-14-17(28)13-21(32)25(36)31-27(2,3)4/h5-11,17,20-21,23,33-34H,12-14H2,1-4H3,(H,30,35)(H,31,36)/t17-,20-,21-,23-/m0/s1
n/an/a 0.700n/an/an/an/an/an/a
Sankyo Co. Ltd.
Assay Description
The inhibitory activities of the compounds toward HIV-1 PR were determined by sodium dodecyl sulfate-polyacrylamide gel electrophoresis (SDS-PAGE) as...
Bioorg Med Chem 7: 2063-72 (1999)
Article DOI: 10.1016/s0968-0896(99)00127-3
BindingDB Entry DOI: 10.7270/Q23T9FD0