BDBM4133 (2S,4S)-N-tert-butyl-4-chloro-1-[(2S,3S)-4-(2,4-difluorophenyl)-2-hydroxy-3-[(3-hydroxy-2-methylphenyl)formamido]butanoyl]pyrrolidine-2-carboxamide::(3-Hydroxy-2-methylbenzoyl)-{2(S)-hydroxy-3(S)-amino-4-(2,4-difluoro)-phenylbutanoyl}-4(S)-Cl-Pro-NH-t-Bu::AHPBA deriv. 18
SMILES: Cc1c(O)cccc1C(=O)N[C@@H](Cc1ccc(F)cc1F)[C@H](O)C(=O)N1C[C@@H](Cl)C[C@H]1C(=O)NC(C)(C)C
InChI Key: InChIKey=DCQHDNGVQYKJCE-IWZNJAMVSA-N
Data: 1 IC50
Activity Spreadsheet -- Enzyme Inhibition Constant Data from BindingDB
Found 1 hit for monomerid = 4133
Trg + Lig
Ki
nM
ΔG°
kcal/mole
IC50
nM
Kd
nM
EC50/IC50
nM
koff
s-1
kon
M-1s-1
pHTemp
°C
HIV-1 Protease
(Human immunodeficiency virus type 1)
BDBM4133
((2S,4S)-N-tert-butyl-4-chloro-1-[(2S,3S)-4-(2,4-di...)
Show SMILES Cc1c(O)cccc1C(=O)N[C@@H](Cc1ccc(F)cc1F)[C@H](O)C(=O)N1C[C@@H](Cl)C[C@H]1C(=O)NC(C)(C)C |r|
Show InChI InChI=1S/C27H32ClF2N3O5/c1-14-18(6-5-7-22(14)34)24(36)31-20(10-15-8-9-17(29)12-19(15)30)23(35)26(38)33-13-16(28)11-21(33)25(37)32-27(2,3)4/h5-9,12,16,20-21,23,34-35H,10-11,13H2,1-4H3,(H,31,36)(H,32,37)/t16-,20-,21-,23-/m0/s1
n/an/a 1.60n/an/an/an/an/an/a
Sankyo Co. Ltd.
Assay Description
The inhibitory activities of the compounds toward HIV-1 PR were determined by sodium dodecyl sulfate-polyacrylamide gel electrophoresis (SDS-PAGE) as...
Bioorg Med Chem 7: 2063-72 (1999)
Article DOI: 10.1016/s0968-0896(99)00127-3
BindingDB Entry DOI: 10.7270/Q23T9FD0