BDBM4139 (2S,4S)-N-tert-butyl-4-chloro-1-[(2S,3S)-4-(3,4-dimethylphenyl)-2-hydroxy-3-[(3-hydroxy-2-methylphenyl)formamido]butanoyl]pyrrolidine-2-carboxamide::(3-Hydroxy-2-methylbenzoyl)-2(S)-hydroxy-3(S)-amino-4-(3,4-dimethyl)-phenylbutanoyl}-4(S)-Cl-Pro-NH-t-Bu::AHPBA deriv. 24
SMILES: Cc1ccc(C[C@H](NC(=O)c2cccc(O)c2C)[C@H](O)C(=O)N2C[C@@H](Cl)C[C@H]2C(=O)NC(C)(C)C)cc1C
InChI Key: InChIKey=SPLAFEVOURVZFE-IVIIFCHOSA-N
Data: 1 IC50
Activity Spreadsheet -- Enzyme Inhibition Constant Data from BindingDB
Found 1 hit for monomerid = 4139
Trg + Lig
Ki
nM
ΔG°
kcal/mole
IC50
nM
Kd
nM
EC50/IC50
nM
koff
s-1
kon
M-1s-1
pHTemp
°C
HIV-1 Protease
(Human immunodeficiency virus type 1)
BDBM4139
((2S,4S)-N-tert-butyl-4-chloro-1-[(2S,3S)-4-(3,4-di...)
Show SMILES Cc1ccc(C[C@H](NC(=O)c2cccc(O)c2C)[C@H](O)C(=O)N2C[C@@H](Cl)C[C@H]2C(=O)NC(C)(C)C)cc1C |r|
Show InChI InChI=1S/C29H38ClN3O5/c1-16-10-11-19(12-17(16)2)13-22(31-26(36)21-8-7-9-24(34)18(21)3)25(35)28(38)33-15-20(30)14-23(33)27(37)32-29(4,5)6/h7-12,20,22-23,25,34-35H,13-15H2,1-6H3,(H,31,36)(H,32,37)/t20-,22-,23-,25-/m0/s1
n/an/a 1.20n/an/an/an/an/an/a
Sankyo Co. Ltd.
Assay Description
The inhibitory activities of the compounds toward HIV-1 PR were determined by sodium dodecyl sulfate-polyacrylamide gel electrophoresis (SDS-PAGE) as...
Bioorg Med Chem 7: 2063-72 (1999)
Article DOI: 10.1016/s0968-0896(99)00127-3
BindingDB Entry DOI: 10.7270/Q23T9FD0