BDBM4166 (2S,4S)-1-[(2S,3S)-4-(1-benzothiophen-5-yl)-2-hydroxy-3-[(3-hydroxy-2,5-dimethylphenyl)formamido]butanoyl]-N-tert-butyl-4-chloropyrrolidine-2-carboxamide::(3-Hydroxy-2,5-dimethylbenzoyl)-{2(S)-hydroxy-3(S)-amino-4-(benzo[b]thiophene-5-yl)-butanoyl}-4(S)-Cl-Pro-NH-t-Bu::AHPBA deriv. 51
SMILES: Cc1cc(O)c(C)c(c1)C(=O)N[C@@H](Cc1ccc2sccc2c1)[C@H](O)C(=O)N1C[C@@H](Cl)C[C@H]1C(=O)NC(C)(C)C
InChI Key: InChIKey=WYEUCVSBGZKBNF-SZBRSHHCSA-N
Data: 1 IC50
Activity Spreadsheet -- Enzyme Inhibition Constant Data from BindingDB
Found 1 hit for monomerid = 4166
Trg + Lig
Ki
nM
ΔG°
kcal/mole
IC50
nM
Kd
nM
EC50/IC50
nM
koff
s-1
kon
M-1s-1
pHTemp
°C
HIV-1 Protease
(Human immunodeficiency virus type 1)
BDBM4166
((2S,4S)-1-[(2S,3S)-4-(1-benzothiophen-5-yl)-2-hydr...)
Show SMILES Cc1cc(O)c(C)c(c1)C(=O)N[C@@H](Cc1ccc2sccc2c1)[C@H](O)C(=O)N1C[C@@H](Cl)C[C@H]1C(=O)NC(C)(C)C |r|
Show InChI InChI=1S/C30H36ClN3O5S/c1-16-10-21(17(2)24(35)11-16)27(37)32-22(13-18-6-7-25-19(12-18)8-9-40-25)26(36)29(39)34-15-20(31)14-23(34)28(38)33-30(3,4)5/h6-12,20,22-23,26,35-36H,13-15H2,1-5H3,(H,32,37)(H,33,38)/t20-,22-,23-,26-/m0/s1
n/an/a 1.5n/an/an/an/an/an/a
Sankyo Co. Ltd.
Assay Description
The inhibitory activities of the compounds toward HIV-1 PR were determined by sodium dodecyl sulfate-polyacrylamide gel electrophoresis (SDS-PAGE) as...
Bioorg Med Chem 7: 2063-72 (1999)
Article DOI: 10.1016/s0968-0896(99)00127-3
BindingDB Entry DOI: 10.7270/Q23T9FD0