BDBM4169 1,6-naphthyridin-2(1H)-one deriv. 7b::3-(2,6-Dichlorophenyl)-1-methyl-7-(methylamino)-1,6-naphthyridin-2(1H)-one::3-(2,6-dichlorophenyl)-1-methyl-7-(methylamino)-1,2-dihydro-1,6-naphthyridin-2-one
SMILES: CNc1cc2n(C)c(=O)c(cc2cn1)-c1c(Cl)cccc1Cl
InChI Key: InChIKey=MWTPPQWWCAVXIS-UHFFFAOYSA-N
Data: 3 IC50
Activity Spreadsheet -- Enzyme Inhibition Constant Data from BindingDB
Found 3 hits for monomerid = 4169
Trg + Lig
Ki
nM
ΔG°
kcal/mole
IC50
nM
Kd
nM
EC50/IC50
nM
koff
s-1
kon
M-1s-1
pHTemp
°C
Platelet-derived growth factor receptor beta
(Homo sapiens (Human))
BDBM4169
(1,6-naphthyridin-2(1H)-one deriv. 7b | 3-(2,6-Dich...)
Show SMILES CNc1cc2n(C)c(=O)c(cc2cn1)-c1c(Cl)cccc1Cl |(-6.52,-3.49,;-6.52,-1.95,;-5.18,-1.18,;-3.85,-1.95,;-2.52,-1.12,;-1.18,-1.89,;-1.18,-3.43,;.15,-1.12,;1.48,-1.89,;.15,.42,;-1.18,1.19,;-2.52,.42,;-3.85,1.13,;-5.18,.36,;1.48,1.19,;1.48,2.73,;.15,3.5,;2.82,3.5,;4.15,2.73,;4.15,1.19,;2.82,.42,;2.82,-1.12,)|
Show InChI InChI=1S/C16H13Cl2N3O/c1-19-14-7-13-9(8-20-14)6-10(16(22)21(13)2)15-11(17)4-3-5-12(15)18/h3-8H,1-2H3,(H,19,20)
NCI pathway
Reactome pathway
n/an/a 8.00E+3n/an/an/an/a7.025
University of Auckland
Assay Description
IC50 is the inhibitor concentration which inhibits 50% of kinase activity that catalyzes the transfer of the terminal phosphate from [gamma-32P] labe...
J Med Chem 43: 3134-47 (2000)
Article DOI: 10.1021/jm000148t
BindingDB Entry DOI: 10.7270/Q2028PQ1
Proto-oncogene tyrosine-protein kinase Src
(Homo sapiens (Human))
BDBM4169
(1,6-naphthyridin-2(1H)-one deriv. 7b | 3-(2,6-Dich...)
Show SMILES CNc1cc2n(C)c(=O)c(cc2cn1)-c1c(Cl)cccc1Cl |(-6.52,-3.49,;-6.52,-1.95,;-5.18,-1.18,;-3.85,-1.95,;-2.52,-1.12,;-1.18,-1.89,;-1.18,-3.43,;.15,-1.12,;1.48,-1.89,;.15,.42,;-1.18,1.19,;-2.52,.42,;-3.85,1.13,;-5.18,.36,;1.48,1.19,;1.48,2.73,;.15,3.5,;2.82,3.5,;4.15,2.73,;4.15,1.19,;2.82,.42,;2.82,-1.12,)|
Show InChI InChI=1S/C16H13Cl2N3O/c1-19-14-7-13-9(8-20-14)6-10(16(22)21(13)2)15-11(17)4-3-5-12(15)18/h3-8H,1-2H3,(H,19,20)
n/an/a 420n/an/an/an/a7.522
University of Auckland
Assay Description
IC50 is the inhibitor concentration which inhibits 50% of kinase activity that catalyzes the transfer of the terminal phosphate from [gamma-32P] labe...
J Med Chem 43: 3134-47 (2000)
Article DOI: 10.1021/jm000148t
BindingDB Entry DOI: 10.7270/Q2028PQ1
Fibroblast growth factor receptor 1
(Homo sapiens (Human))
BDBM4169
(1,6-naphthyridin-2(1H)-one deriv. 7b | 3-(2,6-Dich...)
Show SMILES CNc1cc2n(C)c(=O)c(cc2cn1)-c1c(Cl)cccc1Cl |(-6.52,-3.49,;-6.52,-1.95,;-5.18,-1.18,;-3.85,-1.95,;-2.52,-1.12,;-1.18,-1.89,;-1.18,-3.43,;.15,-1.12,;1.48,-1.89,;.15,.42,;-1.18,1.19,;-2.52,.42,;-3.85,1.13,;-5.18,.36,;1.48,1.19,;1.48,2.73,;.15,3.5,;2.82,3.5,;4.15,2.73,;4.15,1.19,;2.82,.42,;2.82,-1.12,)|
Show InChI InChI=1S/C16H13Cl2N3O/c1-19-14-7-13-9(8-20-14)6-10(16(22)21(13)2)15-11(17)4-3-5-12(15)18/h3-8H,1-2H3,(H,19,20)
NCI pathway
Reactome pathway
n/an/a 210n/an/an/an/a7.025
University of Auckland
Assay Description
IC50 is the inhibitor concentration which inhibits 50% of kinase activity that catalyzes the transfer of the terminal phosphate from [gamma-32P] labe...
J Med Chem 43: 3134-47 (2000)
Article DOI: 10.1021/jm000148t
BindingDB Entry DOI: 10.7270/Q2028PQ1