null
SMILES: COc1cccc(OC)c1C(=O)N1CCN(CC1)c1ccccn1
InChI Key: InChIKey=SFCMHKMQHYHCNL-UHFFFAOYSA-N
Activity Spreadsheet -- Enzyme Inhibition Constant Data from BindingDB
Found 3 hits for monomerid = 41793
Trg + Lig
Ki
nM
ΔG°
kcal/mole
IC50
nM
Kd
nM
EC50/IC50
nM
koff
s-1
kon
M-1s-1
pHTemp
°C
Serine/threonine-protein kinase PLK1
(Homo sapiens (Human))
BDBM41793
((2,6-dimethoxyphenyl)-(4-pyridin-2-ylpiperazin-1-y...)
Show SMILES COc1cccc(OC)c1C(=O)N1CCN(CC1)c1ccccn1
Show InChI InChI=1S/C18H21N3O3/c1-23-14-6-5-7-15(24-2)17(14)18(22)21-12-10-20(11-13-21)16-8-3-4-9-19-16/h3-9H,10-13H2,1-2H3
NCI pathway
Reactome pathway
PCBioAssay
n/an/an/an/a>5.00E+4n/an/an/an/a
University of Pittsburgh Molecular Library Screening Center
Curated by PubChem BioAssay
Assay Description
List of compounds to be tested: Compounds that met the active criterion of Z-score is
PubChem Bioassay (2007)
BindingDB Entry DOI: 10.7270/Q2Z036KJ
Serine/threonine-protein kinase PLK1
(Homo sapiens (Human))
BDBM41793
((2,6-dimethoxyphenyl)-(4-pyridin-2-ylpiperazin-1-y...)
Show SMILES COc1cccc(OC)c1C(=O)N1CCN(CC1)c1ccccn1
Show InChI InChI=1S/C18H21N3O3/c1-23-14-6-5-7-15(24-2)17(14)18(22)21-12-10-20(11-13-21)16-8-3-4-9-19-16/h3-9H,10-13H2,1-2H3
NCI pathway
Reactome pathway
PCBioAssay
n/an/an/an/a>5.00E+4n/an/an/an/a
University of Pittsburgh Molecular Library Screening Center
Curated by PubChem BioAssay
Assay Description
List of compounds to be tested: Compounds that met the active criterion of Z-score is
PubChem Bioassay (2007)
BindingDB Entry DOI: 10.7270/Q2N58JS6
Serine/threonine-protein kinase PLK1
(Homo sapiens (Human))
BDBM41793
((2,6-dimethoxyphenyl)-(4-pyridin-2-ylpiperazin-1-y...)
Show SMILES COc1cccc(OC)c1C(=O)N1CCN(CC1)c1ccccn1
Show InChI InChI=1S/C18H21N3O3/c1-23-14-6-5-7-15(24-2)17(14)18(22)21-12-10-20(11-13-21)16-8-3-4-9-19-16/h3-9H,10-13H2,1-2H3
NCI pathway
Reactome pathway
PCBioAssay
n/an/a>5.00E+4n/an/an/an/an/an/a
University of Pittsburgh Molecular Library Screening Center
Curated by PubChem BioAssay
Assay Description
List of compounds to be tested: Compounds that met the active criterion of Z-score is
PubChem Bioassay (2007)
BindingDB Entry DOI: 10.7270/Q2T72FVT