BDBM4183 1,6-naphthyridin-2(1H)-one deriv. 7p::3-(2,6-Dichlorophenyl)-7-[(4-methoxyphenyl)amino]-1-methyl-1,6-naphthyridin-2(1H)-one::3-(2,6-dichlorophenyl)-7-[(4-methoxyphenyl)amino]-1-methyl-1,2-dihydro-1,6-naphthyridin-2-one
SMILES: COc1ccc(Nc2cc3n(C)c(=O)c(cc3cn2)-c2c(Cl)cccc2Cl)cc1
InChI Key: InChIKey=QQLWYDYVUOBKGW-UHFFFAOYSA-N
Data: 3 IC50
Activity Spreadsheet -- Enzyme Inhibition Constant Data from BindingDB
Found 3 hits for monomerid = 4183
Trg + Lig
Ki
nM
ΔG°
kcal/mole
IC50
nM
Kd
nM
EC50/IC50
nM
koff
s-1
kon
M-1s-1
pHTemp
°C
Platelet-derived growth factor receptor beta
(Homo sapiens (Human))
BDBM4183
(1,6-naphthyridin-2(1H)-one deriv. 7p | 3-(2,6-Dich...)
Show SMILES COc1ccc(Nc2cc3n(C)c(=O)c(cc3cn2)-c2c(Cl)cccc2Cl)cc1 |(-11.85,2.67,;-11.85,1.13,;-10.52,.36,;-10.52,-1.18,;-9.18,-1.95,;-7.85,-1.18,;-6.52,-1.95,;-5.18,-1.18,;-3.85,-1.95,;-2.52,-1.12,;-1.18,-1.89,;-1.18,-3.43,;.15,-1.12,;1.48,-1.89,;.15,.42,;-1.18,1.19,;-2.52,.42,;-3.85,1.13,;-5.18,.36,;1.48,1.19,;1.48,2.73,;.15,3.5,;2.82,3.5,;4.15,2.73,;4.15,1.19,;2.82,.42,;2.82,-1.12,;-7.85,.36,;-9.18,1.13,)|
Show InChI InChI=1S/C22H17Cl2N3O2/c1-27-19-11-20(26-14-6-8-15(29-2)9-7-14)25-12-13(19)10-16(22(27)28)21-17(23)4-3-5-18(21)24/h3-12H,1-2H3,(H,25,26)
NCI pathway
Reactome pathway
n/an/a 6.80E+3n/an/an/an/an/an/a
University of Auckland
Assay Description
IC50 is the inhibitor concentration which inhibits 50% of kinase activity that catalyzes the transfer of the terminal phosphate from [gamma-32P] labe...
J Med Chem 43: 3134-47 (2000)
Article DOI: 10.1021/jm000148t
BindingDB Entry DOI: 10.7270/Q2028PQ1
Proto-oncogene tyrosine-protein kinase Src
(Homo sapiens (Human))
BDBM4183
(1,6-naphthyridin-2(1H)-one deriv. 7p | 3-(2,6-Dich...)
Show SMILES COc1ccc(Nc2cc3n(C)c(=O)c(cc3cn2)-c2c(Cl)cccc2Cl)cc1 |(-11.85,2.67,;-11.85,1.13,;-10.52,.36,;-10.52,-1.18,;-9.18,-1.95,;-7.85,-1.18,;-6.52,-1.95,;-5.18,-1.18,;-3.85,-1.95,;-2.52,-1.12,;-1.18,-1.89,;-1.18,-3.43,;.15,-1.12,;1.48,-1.89,;.15,.42,;-1.18,1.19,;-2.52,.42,;-3.85,1.13,;-5.18,.36,;1.48,1.19,;1.48,2.73,;.15,3.5,;2.82,3.5,;4.15,2.73,;4.15,1.19,;2.82,.42,;2.82,-1.12,;-7.85,.36,;-9.18,1.13,)|
Show InChI InChI=1S/C22H17Cl2N3O2/c1-27-19-11-20(26-14-6-8-15(29-2)9-7-14)25-12-13(19)10-16(22(27)28)21-17(23)4-3-5-18(21)24/h3-12H,1-2H3,(H,25,26)
n/an/a 1.80E+3n/an/an/an/an/an/a
University of Auckland
Assay Description
IC50 is the inhibitor concentration which inhibits 50% of kinase activity that catalyzes the transfer of the terminal phosphate from [gamma-32P] labe...
J Med Chem 43: 3134-47 (2000)
Article DOI: 10.1021/jm000148t
BindingDB Entry DOI: 10.7270/Q2028PQ1
Fibroblast growth factor receptor 1
(Homo sapiens (Human))
BDBM4183
(1,6-naphthyridin-2(1H)-one deriv. 7p | 3-(2,6-Dich...)
Show SMILES COc1ccc(Nc2cc3n(C)c(=O)c(cc3cn2)-c2c(Cl)cccc2Cl)cc1 |(-11.85,2.67,;-11.85,1.13,;-10.52,.36,;-10.52,-1.18,;-9.18,-1.95,;-7.85,-1.18,;-6.52,-1.95,;-5.18,-1.18,;-3.85,-1.95,;-2.52,-1.12,;-1.18,-1.89,;-1.18,-3.43,;.15,-1.12,;1.48,-1.89,;.15,.42,;-1.18,1.19,;-2.52,.42,;-3.85,1.13,;-5.18,.36,;1.48,1.19,;1.48,2.73,;.15,3.5,;2.82,3.5,;4.15,2.73,;4.15,1.19,;2.82,.42,;2.82,-1.12,;-7.85,.36,;-9.18,1.13,)|
Show InChI InChI=1S/C22H17Cl2N3O2/c1-27-19-11-20(26-14-6-8-15(29-2)9-7-14)25-12-13(19)10-16(22(27)28)21-17(23)4-3-5-18(21)24/h3-12H,1-2H3,(H,25,26)
NCI pathway
Reactome pathway
n/an/a 2.20E+3n/an/an/an/an/an/a
University of Auckland
Assay Description
IC50 is the inhibitor concentration which inhibits 50% of kinase activity that catalyzes the transfer of the terminal phosphate from [gamma-32P] labe...
J Med Chem 43: 3134-47 (2000)
Article DOI: 10.1021/jm000148t
BindingDB Entry DOI: 10.7270/Q2028PQ1