BDBM4184 1,6-naphthyridin-2(1H)-one deriv. 7q::3-(2,6-Dichlorophenyl)-7-[[4-[2-(diethylamino)ethoxy]-phenyl]amino]-1-methyl-1,6-naphthyridin-2(1H)-one::3-(2,6-dichlorophenyl)-7-({4-[2-(diethylamino)ethoxy]phenyl}amino)-1-methyl-1,2-dihydro-1,6-naphthyridin-2-one
SMILES: CCN(CC)CCOc1ccc(Nc2cc3n(C)c(=O)c(cc3cn2)-c2c(Cl)cccc2Cl)cc1
InChI Key: InChIKey=CUYDHVPGXKUUEZ-UHFFFAOYSA-N
Data: 3 IC50
Activity Spreadsheet -- Enzyme Inhibition Constant Data from BindingDB
Found 3 hits for monomerid = 4184
Trg + Lig
Ki
nM
ΔG°
kcal/mole
IC50
nM
Kd
nM
EC50/IC50
nM
koff
s-1
kon
M-1s-1
pHTemp
°C
Platelet-derived growth factor receptor beta
(Homo sapiens (Human))
BDBM4184
(1,6-naphthyridin-2(1H)-one deriv. 7q | 3-(2,6-Dich...)
Show SMILES CCN(CC)CCOc1ccc(Nc2cc3n(C)c(=O)c(cc3cn2)-c2c(Cl)cccc2Cl)cc1 |(-14.52,7.29,;-14.52,5.75,;-13.19,4.98,;-11.85,5.75,;-10.52,4.98,;-13.19,3.44,;-11.85,2.67,;-11.85,1.13,;-10.52,.36,;-10.52,-1.18,;-9.18,-1.95,;-7.85,-1.18,;-6.52,-1.95,;-5.18,-1.18,;-3.85,-1.95,;-2.52,-1.12,;-1.18,-1.89,;-1.18,-3.43,;.15,-1.12,;1.48,-1.89,;.15,.42,;-1.18,1.19,;-2.52,.42,;-3.85,1.13,;-5.18,.36,;1.48,1.19,;1.48,2.73,;.15,3.5,;2.82,3.5,;4.15,2.73,;4.15,1.19,;2.82,.42,;2.82,-1.12,;-7.85,.36,;-9.18,1.13,)|
Show InChI InChI=1S/C27H28Cl2N4O2/c1-4-33(5-2)13-14-35-20-11-9-19(10-12-20)31-25-16-24-18(17-30-25)15-21(27(34)32(24)3)26-22(28)7-6-8-23(26)29/h6-12,15-17H,4-5,13-14H2,1-3H3,(H,30,31)
NCI pathway
Reactome pathway
n/an/a 100n/an/an/an/an/an/a
University of Auckland
Assay Description
IC50 is the inhibitor concentration which inhibits 50% of kinase activity that catalyzes the transfer of the terminal phosphate from [gamma-32P] labe...
J Med Chem 43: 3134-47 (2000)
Article DOI: 10.1021/jm000148t
BindingDB Entry DOI: 10.7270/Q2028PQ1
Proto-oncogene tyrosine-protein kinase Src
(Homo sapiens (Human))
BDBM4184
(1,6-naphthyridin-2(1H)-one deriv. 7q | 3-(2,6-Dich...)
Show SMILES CCN(CC)CCOc1ccc(Nc2cc3n(C)c(=O)c(cc3cn2)-c2c(Cl)cccc2Cl)cc1 |(-14.52,7.29,;-14.52,5.75,;-13.19,4.98,;-11.85,5.75,;-10.52,4.98,;-13.19,3.44,;-11.85,2.67,;-11.85,1.13,;-10.52,.36,;-10.52,-1.18,;-9.18,-1.95,;-7.85,-1.18,;-6.52,-1.95,;-5.18,-1.18,;-3.85,-1.95,;-2.52,-1.12,;-1.18,-1.89,;-1.18,-3.43,;.15,-1.12,;1.48,-1.89,;.15,.42,;-1.18,1.19,;-2.52,.42,;-3.85,1.13,;-5.18,.36,;1.48,1.19,;1.48,2.73,;.15,3.5,;2.82,3.5,;4.15,2.73,;4.15,1.19,;2.82,.42,;2.82,-1.12,;-7.85,.36,;-9.18,1.13,)|
Show InChI InChI=1S/C27H28Cl2N4O2/c1-4-33(5-2)13-14-35-20-11-9-19(10-12-20)31-25-16-24-18(17-30-25)15-21(27(34)32(24)3)26-22(28)7-6-8-23(26)29/h6-12,15-17H,4-5,13-14H2,1-3H3,(H,30,31)
n/an/a 78n/an/an/an/an/an/a
University of Auckland
Assay Description
IC50 is the inhibitor concentration which inhibits 50% of kinase activity that catalyzes the transfer of the terminal phosphate from [gamma-32P] labe...
J Med Chem 43: 3134-47 (2000)
Article DOI: 10.1021/jm000148t
BindingDB Entry DOI: 10.7270/Q2028PQ1
Fibroblast growth factor receptor 1
(Homo sapiens (Human))
BDBM4184
(1,6-naphthyridin-2(1H)-one deriv. 7q | 3-(2,6-Dich...)
Show SMILES CCN(CC)CCOc1ccc(Nc2cc3n(C)c(=O)c(cc3cn2)-c2c(Cl)cccc2Cl)cc1 |(-14.52,7.29,;-14.52,5.75,;-13.19,4.98,;-11.85,5.75,;-10.52,4.98,;-13.19,3.44,;-11.85,2.67,;-11.85,1.13,;-10.52,.36,;-10.52,-1.18,;-9.18,-1.95,;-7.85,-1.18,;-6.52,-1.95,;-5.18,-1.18,;-3.85,-1.95,;-2.52,-1.12,;-1.18,-1.89,;-1.18,-3.43,;.15,-1.12,;1.48,-1.89,;.15,.42,;-1.18,1.19,;-2.52,.42,;-3.85,1.13,;-5.18,.36,;1.48,1.19,;1.48,2.73,;.15,3.5,;2.82,3.5,;4.15,2.73,;4.15,1.19,;2.82,.42,;2.82,-1.12,;-7.85,.36,;-9.18,1.13,)|
Show InChI InChI=1S/C27H28Cl2N4O2/c1-4-33(5-2)13-14-35-20-11-9-19(10-12-20)31-25-16-24-18(17-30-25)15-21(27(34)32(24)3)26-22(28)7-6-8-23(26)29/h6-12,15-17H,4-5,13-14H2,1-3H3,(H,30,31)
NCI pathway
Reactome pathway
n/an/a 130n/an/an/an/an/an/a
University of Auckland
Assay Description
IC50 is the inhibitor concentration which inhibits 50% of kinase activity that catalyzes the transfer of the terminal phosphate from [gamma-32P] labe...
J Med Chem 43: 3134-47 (2000)
Article DOI: 10.1021/jm000148t
BindingDB Entry DOI: 10.7270/Q2028PQ1