BDBM41968 6-[4-morpholinyl-(2,3,4-trimethoxyphenyl)methyl]-1,3-benzodioxol-5-ol::6-[morpholin-4-yl-(2,3,4-trimethoxyphenyl)methyl]-1,3-benzodioxol-5-ol::6-[morpholino-(2,3,4-trimethoxyphenyl)methyl]sesamol::cid_343009
SMILES: COc1ccc(C(N2CCOCC2)c2cc3OCOc3cc2O)c(OC)c1OC
InChI Key: InChIKey=OYYIBFSKJVCFSP-UHFFFAOYSA-N
Data: 1 IC50
Activity Spreadsheet -- Enzyme Inhibition Constant Data from BindingDB
Found 1 hit for monomerid = 41968
Trg + Lig
Ki
nM
ΔG°
kcal/mole
IC50
nM
Kd
nM
EC50/IC50
nM
koff
s-1
kon
M-1s-1
pHTemp
°C
Mothers against decapentaplegic homolog 3
(Homo sapiens (Human))
BDBM41968
(6-[4-morpholinyl-(2,3,4-trimethoxyphenyl)methyl]-1...)
Show SMILES COc1ccc(C(N2CCOCC2)c2cc3OCOc3cc2O)c(OC)c1OC
Show InChI InChI=1S/C21H25NO7/c1-24-16-5-4-13(20(25-2)21(16)26-3)19(22-6-8-27-9-7-22)14-10-17-18(11-15(14)23)29-12-28-17/h4-5,10-11,19,23H,6-9,12H2,1-3H3
Reactome pathway
PCBioAssay
n/an/a 3.97E+3n/an/an/an/an/an/a
Emory University Molecular Libraries Screening Center
Curated by PubChem BioAssay
Assay Description
NIH Molecular Libraries Screening Centers Network [MLSCN] Emory Chemical Biology Discovery Center in MLSCN Assay provider: F.M. Hoffmann, University ...
PubChem Bioassay (2008)
BindingDB Entry DOI: 10.7270/Q21R6NZ6