null
SMILES: COc1cn2nccc2cc1Nc1ncnc2sc3C[C@H](CCc3c12)C(=O)N1CCN(C)CC1
InChI Key: InChIKey=KLQMCERMAYQBDJ-HNNXBMFYSA-N
Activity Spreadsheet -- Enzyme Inhibition Constant Data from BindingDB
Found 1 hit for monomerid = 420265
Trg + Lig
Ki
nM
ΔG°
kcal/mole
IC50
nM
Kd
nM
EC50/IC50
nM
koff
s-1
kon
M-1s-1
pHTemp
°C
Isoform 2 of MAP kinase-interacting serine/threonine-protein kinase 1 (MNK1a) 344D]
(Homo sapiens (Human))
BDBM420265
((7S)-4-[(6-Methoxypyrazolo[1,5-a]pyridin-5-yl)amin...)
Show SMILES COc1cn2nccc2cc1Nc1ncnc2sc3C[C@H](CCc3c12)C(=O)N1CCN(C)CC1 |r|
Show InChI InChI=1S/C24H27N7O2S/c1-29-7-9-30(10-8-29)24(32)15-3-4-17-20(11-15)34-23-21(17)22(25-14-26-23)28-18-12-16-5-6-27-31(16)13-19(18)33-2/h5-6,12-15H,3-4,7-11H2,1-2H3,(H,25,26,28)/t15-/m0/s1
US Patent
n/an/a 1n/an/an/an/an/an/a
BAYER PHARMA AKTIENGESELLSCHAFT
US Patent
Assay Description
A recombinant fusion protein of Glutathione-S-Transferase (GST, N-terminally) and human full-length MKNK1 (amino acids 1-424 and T344D of accession n...
US Patent US10487092 (2019)
BindingDB Entry DOI: 10.7270/Q28W3GPZ