BDBM4214 4-{[6-(2,6-dichlorophenyl)-8-methyl-7-oxo-7H,8H-pyrido[2,3-d]pyrimidin-2-yl]amino}-N,N-diethylbenzamide::Pyrido[2,3-d]pyrimidin-7(8H)-one deriv. 6w
SMILES: CCN(CC)C(=O)c1ccc(Nc2ncc3cc(-c4c(Cl)cccc4Cl)c(=O)n(C)c3n2)cc1
InChI Key: InChIKey=WHPSRWXDXFWLHF-UHFFFAOYSA-N
Data: 3 IC50
Activity Spreadsheet -- Enzyme Inhibition Constant Data from BindingDB
Found 3 hits for monomerid = 4214
Trg + Lig
Ki
nM
ΔG°
kcal/mole
IC50
nM
Kd
nM
EC50/IC50
nM
koff
s-1
kon
M-1s-1
pHTemp
°C
Platelet-derived growth factor receptor beta
(Homo sapiens (Human))
BDBM4214
(4-{[6-(2,6-dichlorophenyl)-8-methyl-7-oxo-7H,8H-py...)
Show SMILES CCN(CC)C(=O)c1ccc(Nc2ncc3cc(-c4c(Cl)cccc4Cl)c(=O)n(C)c3n2)cc1 |(-13.8,4.21,;-13.8,2.67,;-12.47,1.9,;-12.47,.36,;-13.8,-.41,;-11.11,2.62,;-11.05,4.16,;-9.8,1.8,;-9.86,.26,;-8.55,-.56,;-7.19,.16,;-5.86,-.61,;-4.53,.16,;-4.53,1.7,;-3.19,2.47,;-1.86,1.7,;-.52,2.47,;.81,1.7,;2.14,2.47,;2.14,4.01,;.81,4.78,;3.48,4.78,;4.81,4.01,;4.81,2.47,;3.48,1.7,;3.48,.16,;.81,.16,;2.14,-.61,;-.52,-.61,;-.52,-2.15,;-1.86,.16,;-3.19,-.61,;-7.14,1.7,;-8.44,2.52,)|
Show InChI InChI=1S/C25H23Cl2N5O2/c1-4-32(5-2)23(33)15-9-11-17(12-10-15)29-25-28-14-16-13-18(24(34)31(3)22(16)30-25)21-19(26)7-6-8-20(21)27/h6-14H,4-5H2,1-3H3,(H,28,29,30)
NCI pathway
Reactome pathway
n/an/a 290n/an/an/an/an/an/a
University of Auckland
Assay Description
IC50 is the inhibitor concentration which inhibits 50% of kinase activity that catalyzes the transfer of the terminal phosphate from [gamma-32P] labe...
J Med Chem 43: 3134-47 (2000)
Article DOI: 10.1021/jm000148t
BindingDB Entry DOI: 10.7270/Q2028PQ1
Proto-oncogene tyrosine-protein kinase Src
(Homo sapiens (Human))
BDBM4214
(4-{[6-(2,6-dichlorophenyl)-8-methyl-7-oxo-7H,8H-py...)
Show SMILES CCN(CC)C(=O)c1ccc(Nc2ncc3cc(-c4c(Cl)cccc4Cl)c(=O)n(C)c3n2)cc1 |(-13.8,4.21,;-13.8,2.67,;-12.47,1.9,;-12.47,.36,;-13.8,-.41,;-11.11,2.62,;-11.05,4.16,;-9.8,1.8,;-9.86,.26,;-8.55,-.56,;-7.19,.16,;-5.86,-.61,;-4.53,.16,;-4.53,1.7,;-3.19,2.47,;-1.86,1.7,;-.52,2.47,;.81,1.7,;2.14,2.47,;2.14,4.01,;.81,4.78,;3.48,4.78,;4.81,4.01,;4.81,2.47,;3.48,1.7,;3.48,.16,;.81,.16,;2.14,-.61,;-.52,-.61,;-.52,-2.15,;-1.86,.16,;-3.19,-.61,;-7.14,1.7,;-8.44,2.52,)|
Show InChI InChI=1S/C25H23Cl2N5O2/c1-4-32(5-2)23(33)15-9-11-17(12-10-15)29-25-28-14-16-13-18(24(34)31(3)22(16)30-25)21-19(26)7-6-8-20(21)27/h6-14H,4-5H2,1-3H3,(H,28,29,30)
n/an/a 14n/an/an/an/an/an/a
University of Auckland
Assay Description
IC50 is the inhibitor concentration which inhibits 50% of kinase activity that catalyzes the transfer of the terminal phosphate from [gamma-32P] labe...
J Med Chem 43: 3134-47 (2000)
Article DOI: 10.1021/jm000148t
BindingDB Entry DOI: 10.7270/Q2028PQ1
Fibroblast growth factor receptor 1
(Homo sapiens (Human))
BDBM4214
(4-{[6-(2,6-dichlorophenyl)-8-methyl-7-oxo-7H,8H-py...)
Show SMILES CCN(CC)C(=O)c1ccc(Nc2ncc3cc(-c4c(Cl)cccc4Cl)c(=O)n(C)c3n2)cc1 |(-13.8,4.21,;-13.8,2.67,;-12.47,1.9,;-12.47,.36,;-13.8,-.41,;-11.11,2.62,;-11.05,4.16,;-9.8,1.8,;-9.86,.26,;-8.55,-.56,;-7.19,.16,;-5.86,-.61,;-4.53,.16,;-4.53,1.7,;-3.19,2.47,;-1.86,1.7,;-.52,2.47,;.81,1.7,;2.14,2.47,;2.14,4.01,;.81,4.78,;3.48,4.78,;4.81,4.01,;4.81,2.47,;3.48,1.7,;3.48,.16,;.81,.16,;2.14,-.61,;-.52,-.61,;-.52,-2.15,;-1.86,.16,;-3.19,-.61,;-7.14,1.7,;-8.44,2.52,)|
Show InChI InChI=1S/C25H23Cl2N5O2/c1-4-32(5-2)23(33)15-9-11-17(12-10-15)29-25-28-14-16-13-18(24(34)31(3)22(16)30-25)21-19(26)7-6-8-20(21)27/h6-14H,4-5H2,1-3H3,(H,28,29,30)
NCI pathway
Reactome pathway
n/an/a 180n/an/an/an/an/an/a
University of Auckland
Assay Description
IC50 is the inhibitor concentration which inhibits 50% of kinase activity that catalyzes the transfer of the terminal phosphate from [gamma-32P] labe...
J Med Chem 43: 3134-47 (2000)
Article DOI: 10.1021/jm000148t
BindingDB Entry DOI: 10.7270/Q2028PQ1