BDBM4222 AHPBA 30a::Z.Asn-(2S,3S)-AHPBA.(4,4-difluoro)Pro tert-butylamide::benzyl N-[(1S)-1-{[(2S,3S)-4-[(2S)-2-(tert-butylcarbamoyl)-4,4-difluoropyrrolidin-1-yl]-3-hydroxy-4-oxo-1-phenylbutan-2-yl]carbamoyl}-2-carbamoylethyl]carbamate
SMILES: CC(C)(C)NC(=O)[C@@H]1CC(F)(F)CN1C(=O)[C@@H](O)[C@H](Cc1ccccc1)NC(=O)[C@H](CC(N)=O)NC(=O)OCc1ccccc1
InChI Key: InChIKey=UTUZCFMBNLDYLO-LCXINAFSSA-N
Data: 1 KI
Activity Spreadsheet -- Enzyme Inhibition Constant Data from BindingDB
Found 1 hit for monomerid = 4222
Trg + Lig
Ki
nM
ΔG°
kcal/mole
IC50
nM
Kd
nM
EC50/IC50
nM
koff
s-1
kon
M-1s-1
pHTemp
°C
HIV-1 Protease
(Human immunodeficiency virus type 1)
BDBM4222
(AHPBA 30a | Z.Asn-(2S,3S)-AHPBA.(4,4-difluoro)Pro ...)
Show SMILES CC(C)(C)NC(=O)[C@@H]1CC(F)(F)CN1C(=O)[C@@H](O)[C@H](Cc1ccccc1)NC(=O)[C@H](CC(N)=O)NC(=O)OCc1ccccc1 |r|
Show InChI InChI=1S/C31H39F2N5O7/c1-30(2,3)37-27(42)23-16-31(32,33)18-38(23)28(43)25(40)21(14-19-10-6-4-7-11-19)35-26(41)22(15-24(34)39)36-29(44)45-17-20-12-8-5-9-13-20/h4-13,21-23,25,40H,14-18H2,1-3H3,(H2,34,39)(H,35,41)(H,36,44)(H,37,42)/t21-,22-,23-,25-/m0/s1
35 -10.6n/an/an/an/an/a4.737
Sankyo Co. Ltd.
Assay Description
The inhibitory activities of the compounds toward HIV-1 PR were determined by sodium dodecyl sulfate-polyacrylamide gel electrophoresis (SDS-PAGE) as...
Bioorg Med Chem 4: 1365-77 (1996)
Article DOI: 10.1016/0968-0896(96)00130-7
BindingDB Entry DOI: 10.7270/Q2V9868K