BDBM4223 AHPBA 31a::Z.Asn-(2S,3S)-AHPBA-[ 4(S)-phenylthio]Pro tert-butylamide::benzyl N-[(1S)-1-{[(2S,3S)-4-[(2S)-2-(tert-butylcarbamoyl)-4-(phenylsulfanyl)pyrrolidin-1-yl]-3-hydroxy-4-oxo-1-phenylbutan-2-yl]carbamoyl}-2-carbamoylethyl]carbamate
SMILES: CC(C)(C)NC(=O)[C@@H]1CC(CN1C(=O)[C@@H](O)[C@H](Cc1ccccc1)NC(=O)[C@H](CC(N)=O)NC(=O)OCc1ccccc1)Sc1ccccc1
InChI Key: InChIKey=PXUNBQCJALBCEB-MOOWXTQTSA-N
Data: 1 KI
Activity Spreadsheet -- Enzyme Inhibition Constant Data from BindingDB
Found 1 hit for monomerid = 4223
Trg + Lig
Ki
nM
ΔG°
kcal/mole
IC50
nM
Kd
nM
EC50/IC50
nM
koff
s-1
kon
M-1s-1
pHTemp
°C
HIV-1 Protease
(Human immunodeficiency virus type 1)
BDBM4223
(AHPBA 31a | Z.Asn-(2S,3S)-AHPBA-[ 4(S)-phenylthio]...)
Show SMILES CC(C)(C)NC(=O)[C@@H]1CC(CN1C(=O)[C@@H](O)[C@H](Cc1ccccc1)NC(=O)[C@H](CC(N)=O)NC(=O)OCc1ccccc1)Sc1ccccc1 |r|
Show InChI InChI=1S/C37H45N5O7S/c1-37(2,3)41-34(46)30-20-27(50-26-17-11-6-12-18-26)22-42(30)35(47)32(44)28(19-24-13-7-4-8-14-24)39-33(45)29(21-31(38)43)40-36(48)49-23-25-15-9-5-10-16-25/h4-18,27-30,32,44H,19-23H2,1-3H3,(H2,38,43)(H,39,45)(H,40,48)(H,41,46)/t27?,28-,29-,30-,32-/m0/s1
125 -9.79n/an/an/an/an/a4.737
Sankyo Co. Ltd.
Assay Description
The inhibitory activities of the compounds toward HIV-1 PR were determined by sodium dodecyl sulfate-polyacrylamide gel electrophoresis (SDS-PAGE) as...
Bioorg Med Chem 4: 1365-77 (1996)
Article DOI: 10.1016/0968-0896(96)00130-7
BindingDB Entry DOI: 10.7270/Q2V9868K