BDBM4231 (2S)-N-[(2S,3S)-4-[(2S,4S)-2-(tert-butylcarbamoyl)-4-chloropyrrolidin-1-yl]-3-hydroxy-4-oxo-1-phenylbutan-2-yl]-2-[(5-fluoro-1H-indol-2-yl)formamido]butanediamide::(5-Fluoroindole-2-carbonyl)-Asn-(2S,3S)-AHPBA- [4(S)-chloro]Pro tert-butylamide::AHPBA 39a
SMILES: CC(C)(C)NC(=O)[C@@H]1C[C@H](Cl)CN1C(=O)[C@@H](O)[C@H](Cc1ccccc1)NC(=O)[C@H](CC(N)=O)NC(=O)c1cc2cc(F)ccc2[nH]1
InChI Key: InChIKey=PJGOMZWOYHREKC-KADIJYHYSA-N
Data: 1 KI
Activity Spreadsheet -- Enzyme Inhibition Constant Data from BindingDB
Found 1 hit for monomerid = 4231
Trg + Lig
Ki
nM
ΔG°
kcal/mole
IC50
nM
Kd
nM
EC50/IC50
nM
koff
s-1
kon
M-1s-1
pHTemp
°C
HIV-1 Protease
(Human immunodeficiency virus type 1)
BDBM4231
((2S)-N-[(2S,3S)-4-[(2S,4S)-2-(tert-butylcarbamoyl)...)
Show SMILES CC(C)(C)NC(=O)[C@@H]1C[C@H](Cl)CN1C(=O)[C@@H](O)[C@H](Cc1ccccc1)NC(=O)[C@H](CC(N)=O)NC(=O)c1cc2cc(F)ccc2[nH]1 |r|
Show InChI InChI=1S/C32H38ClFN6O6/c1-32(2,3)39-30(45)25-14-19(33)16-40(25)31(46)27(42)22(11-17-7-5-4-6-8-17)37-29(44)24(15-26(35)41)38-28(43)23-13-18-12-20(34)9-10-21(18)36-23/h4-10,12-13,19,22,24-25,27,36,42H,11,14-16H2,1-3H3,(H2,35,41)(H,37,44)(H,38,43)(H,39,45)/t19-,22-,24-,25-,27-/m0/s1
12.5 -11.2n/an/an/an/an/a4.737
Sankyo Co. Ltd.
Assay Description
The inhibitory activities of the compounds toward HIV-1 PR were determined by sodium dodecyl sulfate-polyacrylamide gel electrophoresis (SDS-PAGE) as...
Bioorg Med Chem 4: 1365-77 (1996)
Article DOI: 10.1016/0968-0896(96)00130-7
BindingDB Entry DOI: 10.7270/Q2V9868K