BDBM429289 med.21724, Compound 25
SMILES: O=C(Nc1ccc2C(=O)c3ccccc3C(=O)c2c1)c1ccccc1
InChI Key: InChIKey=SIGATAYQAZTAOH-UHFFFAOYSA-N
Data: 1 EC50
Activity Spreadsheet -- Enzyme Inhibition Constant Data from BindingDB
Found 1 hit for monomerid = 429289
Trg + Lig
Ki
nM
ΔG°
kcal/mole
IC50
nM
Kd
nM
EC50/IC50
nM
koff
s-1
kon
M-1s-1
pHTemp
°C
Procathepsin L
(Homo sapiens (Human))
BDBM429289
(med.21724, Compound 25)
Show SMILES O=C(Nc1ccc2C(=O)c3ccccc3C(=O)c2c1)c1ccccc1
Show InChI InChI=1S/C21H13NO3/c23-19-15-8-4-5-9-16(15)20(24)18-12-14(10-11-17(18)19)22-21(25)13-6-2-1-3-7-13/h1-12H,(H,22,25)
Reactome pathway
n/an/an/an/a 9.70E+3n/an/an/an/a
University of Bonn
Assay Description
This is a review article.
Med Res Rev (2020)
Article DOI: 10.1002/med.21724
BindingDB Entry DOI: 10.7270/Q2JS9ST6