BDBM4322 (4-Morpholinobenzylidene)malononitrile::2-{[4-(morpholin-4-yl)phenyl]methylidene}propanedinitrile::benzylidenemalononitrile (BMN) deriv. 6::cid_321779
SMILES: N#C\[#6](=[#6]/c1ccc(cc1)-[#7]-1-[#6]-[#6]-[#8]-[#6]-[#6]-1)C#N
InChI Key: InChIKey=CHKTYKSOGLZPFK-UHFFFAOYSA-N
Data: 1 KI  1 IC50  2 EC50
Activity Spreadsheet -- Enzyme Inhibition Constant Data from BindingDB
Found 3 hits for monomerid = 4322
Trg + Lig
Ki
nM
ΔG°
kcal/mole
IC50
nM
Kd
nM
EC50/IC50
nM
koff
s-1
kon
M-1s-1
pHTemp
°C
Epidermal growth factor receptor
(Homo sapiens (Human))
BDBM4322
((4-Morpholinobenzylidene)malononitrile | 2-{[4-(mo...)
Show SMILES N#C\[#6](=[#6]/c1ccc(cc1)-[#7]-1-[#6]-[#6]-[#8]-[#6]-[#6]-1)C#N
Show InChI InChI=1S/C14H13N3O/c15-10-13(11-16)9-12-1-3-14(4-2-12)17-5-7-18-8-6-17/h1-4,9H,5-8H2
>2.50E+5>-4.86>6.25E+5n/an/an/an/a7.622
Hebrew University of Jerusalem
Assay Description
The activity of EGFR, preactivated with EGF, is measured by its ability to transfer terminal phosphate from [gamma-32P]ATP to poly(GAT) substrate.
J Med Chem 32: 2344-52 (1989)
Article DOI: 10.1021/jm00130a020
BindingDB Entry DOI: 10.7270/Q2G44NHF
RecName: Full=Zinc finger protein mex-5
(Caenorhabditis elegans)
BDBM4322
((4-Morpholinobenzylidene)malononitrile | 2-{[4-(mo...)
Show SMILES N#C\[#6](=[#6]/c1ccc(cc1)-[#7]-1-[#6]-[#6]-[#8]-[#6]-[#6]-1)C#N
Show InChI InChI=1S/C14H13N3O/c15-10-13(11-16)9-12-1-3-14(4-2-12)17-5-7-18-8-6-17/h1-4,9H,5-8H2
PCBioAssay
n/an/an/an/a 3.00E+5n/an/an/an/a
Broad Institute
Curated by PubChem BioAssay
Assay Description
Broad Institute: MLPCN maternal gene expression Project ID: 2024 Keywords: Zinc finger, C. elegans, maternal gene expression, RNA-protein interac...
PubChem Bioassay (2009)
BindingDB Entry DOI: 10.7270/Q2D798VP
POsterior Segregation family member (pos-1)
(Caenorhabditis elegans)
BDBM4322
((4-Morpholinobenzylidene)malononitrile | 2-{[4-(mo...)
Show SMILES N#C\[#6](=[#6]/c1ccc(cc1)-[#7]-1-[#6]-[#6]-[#8]-[#6]-[#6]-1)C#N
Show InChI InChI=1S/C14H13N3O/c15-10-13(11-16)9-12-1-3-14(4-2-12)17-5-7-18-8-6-17/h1-4,9H,5-8H2
PCBioAssay
n/an/an/an/a 3.00E+5n/an/an/an/a
Broad Institute
Curated by PubChem BioAssay
Assay Description
Broad Institute: MLPCN maternal gene expression Project ID: 2024 Keywords: Zinc finger, C. elegans, maternal gene expression, RNA-protein interac...
PubChem Bioassay (2009)
BindingDB Entry DOI: 10.7270/Q28G8J4C