null
SMILES: [#6]-[#8]-c1cc(\[#6]=[#6](/C#N)C#N)cc(c1-[#8])-[#7+](-[#8-])=O
InChI Key: InChIKey=CWOXUSIEQFFVBX-UHFFFAOYSA-N
Activity Spreadsheet -- Enzyme Inhibition Constant Data from BindingDB
Found 1 hit for monomerid = 4333
Trg + Lig
Ki
nM
ΔG°
kcal/mole
IC50
nM
Kd
nM
EC50/IC50
nM
koff
s-1
kon
M-1s-1
pHTemp
°C
Epidermal growth factor receptor
(Homo sapiens (Human))
BDBM4333
(2-[(4-hydroxy-3-methoxy-5-nitrophenyl)methylidene]...)
Show SMILES [#6]-[#8]-c1cc(\[#6]=[#6](/C#N)C#N)cc(c1-[#8])-[#7+](-[#8-])=O
Show InChI InChI=1S/C11H7N3O4/c1-18-10-4-7(2-8(5-12)6-13)3-9(11(10)15)14(16)17/h2-4,15H,1H3
5.50E+4 -5.75 1.60E+5n/an/an/an/a7.622
Hebrew University of Jerusalem
Assay Description
The activity of EGFR, preactivated with EGF, is measured by its ability to transfer terminal phosphate from [gamma-32P]ATP to poly(GAT) substrate.
J Med Chem 32: 2344-52 (1989)
Article DOI: 10.1021/jm00130a020
BindingDB Entry DOI: 10.7270/Q2G44NHF