BDBM43341 (Z,3R)-4-formyl-3-(2-ketoethyl)hex-4-enoic acid 2-(4-hydroxyphenyl)ethyl ester::(Z,3R)-4-formyl-3-(2-oxoethyl)-4-hexenoic acid 2-(4-hydroxyphenyl)ethyl ester::2-(4-hydroxyphenyl)ethyl (Z,3R)-4-formyl-3-(2-oxoethyl)hex-4-enoate::2-(4-hydroxyphenyl)ethyl (Z,3R)-4-methanoyl-3-(2-oxidanylideneethyl)hex-4-enoate::PC-0685424::PCMD-CC-JBS-255::cid_16738612
SMILES: C\C=C(/C=O)[C@H](CC=O)CC(=O)OCCc1ccc(O)cc1
InChI Key: InChIKey=VPOVFCBNUOUZGG-FOGCTLQKSA-N
Data: 1 IC50
Activity Spreadsheet -- Enzyme Inhibition Constant Data from BindingDB
Found 1 hit for monomerid = 43341
Trg + Lig
Ki
nM
ΔG°
kcal/mole
IC50
nM
Kd
nM
EC50/IC50
nM
koff
s-1
kon
M-1s-1
pHTemp
°C
RNA polymerase beta subunit (EC 2.7.7.6)
(Escherichia coli)
BDBM43341
((Z,3R)-4-formyl-3-(2-ketoethyl)hex-4-enoic acid 2-...)
Show SMILES C\C=C(/C=O)[C@H](CC=O)CC(=O)OCCc1ccc(O)cc1
Show InChI InChI=1S/C17H20O5/c1-2-14(12-19)15(7-9-18)11-17(21)22-10-8-13-3-5-16(20)6-4-13/h2-6,9,12,15,20H,7-8,10-11H2,1H3/b14-2+/t15-/m1/s1
PCBioAssay
n/an/a 1.29E+4n/an/an/an/an/an/a
PCMD
Curated by PubChem BioAssay
Assay Description
Screening Center: Penn Center for Molecular Discovery Center Affiliation: University of Pennsylvania Network: Molecular Library Screening Center Netw...
PubChem Bioassay (2008)
BindingDB Entry DOI: 10.7270/Q25B00VT