BDBM4338 (3,5-Dihydroxybenzylidene)malononitrile::2-[(3,5-dihydroxyphenyl)methylidene]propanedinitrile::benzylidenemalononitrile (BMN) deriv. 22
SMILES: [#8]-c1cc(-[#8])cc(\[#6]=[#6](/C#N)C#N)c1
InChI Key: InChIKey=CEQLJWDOOOWWJE-UHFFFAOYSA-N
Data: 1 KI  1 IC50
Activity Spreadsheet -- Enzyme Inhibition Constant Data from BindingDB
Found 1 hit for monomerid = 4338
Trg + Lig
Ki
nM
ΔG°
kcal/mole
IC50
nM
Kd
nM
EC50/IC50
nM
koff
s-1
kon
M-1s-1
pHTemp
°C
Epidermal growth factor receptor
(Homo sapiens (Human))
BDBM4338
((3,5-Dihydroxybenzylidene)malononitrile | 2-[(3,5-...)
Show SMILES [#8]-c1cc(-[#8])cc(\[#6]=[#6](/C#N)C#N)c1
Show InChI InChI=1S/C10H6N2O2/c11-5-8(6-12)1-7-2-9(13)4-10(14)3-7/h1-4,13-14H
1.00E+4 -6.75 3.70E+4n/an/an/an/a7.622
Hebrew University of Jerusalem
Assay Description
The activity of EGFR, preactivated with EGF, is measured by its ability to transfer terminal phosphate from [gamma-32P]ATP to poly(GAT) substrate.
J Med Chem 32: 2344-52 (1989)
Article DOI: 10.1021/jm00130a020
BindingDB Entry DOI: 10.7270/Q2G44NHF