BDBM4340 (3,4-Dihydroxy-5-methoxybenzylidene)malononitrile::2-[(3,4-dihydroxy-5-methoxyphenyl)methylidene]propanedinitrile::benzylidenemalononitrile (BMN) deriv. 24
SMILES: [#6]-[#8]-c1cc(\[#6]=[#6](/C#N)C#N)cc(-[#8])c1-[#8]
InChI Key: InChIKey=DWZFIFZYMHNRRV-UHFFFAOYSA-N
Data: 1 KI  1 IC50
Activity Spreadsheet -- Enzyme Inhibition Constant Data from BindingDB
Found 1 hit for monomerid = 4340
Trg + Lig
Ki
nM
ΔG°
kcal/mole
IC50
nM
Kd
nM
EC50/IC50
nM
koff
s-1
kon
M-1s-1
pHTemp
°C
Epidermal growth factor receptor
(Homo sapiens (Human))
BDBM4340
((3,4-Dihydroxy-5-methoxybenzylidene)malononitrile ...)
Show SMILES [#6]-[#8]-c1cc(\[#6]=[#6](/C#N)C#N)cc(-[#8])c1-[#8]
Show InChI InChI=1S/C11H8N2O3/c1-16-10-4-7(2-8(5-12)6-13)3-9(14)11(10)15/h2-4,14-15H,1H3
2.20E+3 -7.64 6.00E+3n/an/an/an/a7.622
Hebrew University of Jerusalem
Assay Description
The activity of EGFR, preactivated with EGF, is measured by its ability to transfer terminal phosphate from [gamma-32P]ATP to poly(GAT) substrate.
J Med Chem 32: 2344-52 (1989)
Article DOI: 10.1021/jm00130a020
BindingDB Entry DOI: 10.7270/Q2G44NHF