null
SMILES: COc1cc(C)[nH]c(=O)c1CN1CCc2c(C)cc(C(C)C3CN(C3)S(C)(=O)=O)c(Cl)c2C1=O
InChI Key:
Activity Spreadsheet -- Enzyme Inhibition Constant Data from BindingDB
Found 4 hits for monomerid = 435685
Trg + Lig
Ki
nM
ΔG°
kcal/mole
IC50
nM
Kd
nM
EC50/IC50
nM
koff
s-1
kon
M-1s-1
pHTemp
°C
Histone-lysine N-methyltransferase EZH2
(Homo sapiens (Human))
BDBM435685
(US10570121, Example 191 | US10570121, Example 192)
Show SMILES COc1cc(C)[nH]c(=O)c1CN1CCc2c(C)cc(C(C)C3CN(C3)S(C)(=O)=O)c(Cl)c2C1=O
US Patent
0.300n/an/an/an/an/an/an/an/a
Pfizer Inc.
US Patent
Assay Description
A. Compound preparation1. Prepare 10 mM stock solutions in 100% DMSO from solid material2. Serial dilute 10 mM compound stocks either 2 or 3-fold in ...
US Patent US10570121 (2020)
BindingDB Entry DOI: 10.7270/Q28W3GQD
Histone-lysine N-methyltransferase EZH2
(Homo sapiens (Human))
BDBM435685
(US10570121, Example 191 | US10570121, Example 192)
Show SMILES COc1cc(C)[nH]c(=O)c1CN1CCc2c(C)cc(C(C)C3CN(C3)S(C)(=O)=O)c(Cl)c2C1=O
US Patent
117n/an/an/an/an/an/an/an/a
Pfizer Inc.
US Patent
Assay Description
A. Compound preparation1. Prepare 10 mM stock solutions in 100% DMSO from solid material2. Serial dilute 10 mM compound stocks either 2 or 3-fold in ...
US Patent US10570121 (2020)
BindingDB Entry DOI: 10.7270/Q28W3GQD
Histone-lysine N-methyltransferase EZH2 [2-746,Y641N]
(Homo sapiens (Human))
BDBM435685
(US10570121, Example 191 | US10570121, Example 192)
Show SMILES COc1cc(C)[nH]c(=O)c1CN1CCc2c(C)cc(C(C)C3CN(C3)S(C)(=O)=O)c(Cl)c2C1=O
NCI pathway
Reactome pathway
US Patent
n/an/a 605n/an/an/an/an/an/a
Pfizer Inc.
US Patent
Assay Description
A. Compound preparation1. Prepare 10 mM stock solutions in 100% DMSO from solid material2. Serial dilute 10 mM compound stocks either 2 or 3-fold in ...
US Patent US10570121 (2020)
BindingDB Entry DOI: 10.7270/Q28W3GQD
Histone-lysine N-methyltransferase EZH2 [2-746,Y641N]
(Homo sapiens (Human))
BDBM435685
(US10570121, Example 191 | US10570121, Example 192)
Show SMILES COc1cc(C)[nH]c(=O)c1CN1CCc2c(C)cc(C(C)C3CN(C3)S(C)(=O)=O)c(Cl)c2C1=O
NCI pathway
Reactome pathway
US Patent
n/an/a 5n/an/an/an/an/an/a
Pfizer Inc.
US Patent
Assay Description
A. Compound preparation1. Prepare 10 mM stock solutions in 100% DMSO from solid material2. Serial dilute 10 mM compound stocks either 2 or 3-fold in ...
US Patent US10570121 (2020)
BindingDB Entry DOI: 10.7270/Q28W3GQD