null
SMILES: CC(C1COC1)c1cc(C)c2CCN(Cc3c(C)cc(C)[nH]c3=O)C(=O)c2c1Cl
InChI Key:
Activity Spreadsheet -- Enzyme Inhibition Constant Data from BindingDB
Found 4 hits for monomerid = 435689
Trg + Lig
Ki
nM
ΔG°
kcal/mole
IC50
nM
Kd
nM
EC50/IC50
nM
koff
s-1
kon
M-1s-1
pHTemp
°C
Histone-lysine N-methyltransferase EZH2
(Homo sapiens (Human))
BDBM435689
(US10570121, Example 195 | US10570121, Example 196)
Show SMILES CC(C1COC1)c1cc(C)c2CCN(Cc3c(C)cc(C)[nH]c3=O)C(=O)c2c1Cl
US Patent
0.200n/an/an/an/an/an/an/an/a
Pfizer Inc.
US Patent
Assay Description
A. Compound preparation1. Prepare 10 mM stock solutions in 100% DMSO from solid material2. Serial dilute 10 mM compound stocks either 2 or 3-fold in ...
US Patent US10570121 (2020)
BindingDB Entry DOI: 10.7270/Q28W3GQD
Histone-lysine N-methyltransferase EZH2
(Homo sapiens (Human))
BDBM435689
(US10570121, Example 195 | US10570121, Example 196)
Show SMILES CC(C1COC1)c1cc(C)c2CCN(Cc3c(C)cc(C)[nH]c3=O)C(=O)c2c1Cl
US Patent
46n/an/an/an/an/an/an/an/a
Pfizer Inc.
US Patent
Assay Description
A. Compound preparation1. Prepare 10 mM stock solutions in 100% DMSO from solid material2. Serial dilute 10 mM compound stocks either 2 or 3-fold in ...
US Patent US10570121 (2020)
BindingDB Entry DOI: 10.7270/Q28W3GQD
Histone-lysine N-methyltransferase EZH2 [2-746,Y641N]
(Homo sapiens (Human))
BDBM435689
(US10570121, Example 195 | US10570121, Example 196)
Show SMILES CC(C1COC1)c1cc(C)c2CCN(Cc3c(C)cc(C)[nH]c3=O)C(=O)c2c1Cl
NCI pathway
Reactome pathway
US Patent
n/an/a 3n/an/an/an/an/an/a
Pfizer Inc.
US Patent
Assay Description
A. Compound preparation1. Prepare 10 mM stock solutions in 100% DMSO from solid material2. Serial dilute 10 mM compound stocks either 2 or 3-fold in ...
US Patent US10570121 (2020)
BindingDB Entry DOI: 10.7270/Q28W3GQD
Histone-lysine N-methyltransferase EZH2 [2-746,Y641N]
(Homo sapiens (Human))
BDBM435689
(US10570121, Example 195 | US10570121, Example 196)
Show SMILES CC(C1COC1)c1cc(C)c2CCN(Cc3c(C)cc(C)[nH]c3=O)C(=O)c2c1Cl
NCI pathway
Reactome pathway
US Patent
n/an/a 216n/an/an/an/an/an/a
Pfizer Inc.
US Patent
Assay Description
A. Compound preparation1. Prepare 10 mM stock solutions in 100% DMSO from solid material2. Serial dilute 10 mM compound stocks either 2 or 3-fold in ...
US Patent US10570121 (2020)
BindingDB Entry DOI: 10.7270/Q28W3GQD