null
SMILES: Clc1ccc(NC(=O)Nc2nccs2)cc1Cl
InChI Key: InChIKey=WQKHTLYMGJLKGP-UHFFFAOYSA-N
Activity Spreadsheet -- Enzyme Inhibition Constant Data from BindingDB
Found 3 hits for monomerid = 43768
Trg + Lig
Ki
nM
ΔG°
kcal/mole
IC50
nM
Kd
nM
EC50/IC50
nM
koff
s-1
kon
M-1s-1
pHTemp
°C
Wee1-like protein kinase
(Homo sapiens (Human))
BDBM43768
(1-(3,4-Dichloro-phenyl)-3-thiazol-2-yl-urea | 1-(3...)
Show SMILES Clc1ccc(NC(=O)Nc2nccs2)cc1Cl
Show InChI InChI=1S/C10H7Cl2N3OS/c11-7-2-1-6(5-8(7)12)14-9(16)15-10-13-3-4-17-10/h1-5H,(H2,13,14,15,16)
NCI pathway
Reactome pathway
PCBioAssay
n/an/an/an/a>4.98E+4n/an/an/an/a
The Scripps Research Institute Molecular Screening Center
Curated by PubChem BioAssay
Assay Description
Source (MLPCN Center Name): The Scripps Research Institute Molecular Screening Center Center Affiliation: The Scripps Research Institute (TSRI) Assay...
PubChem Bioassay (2008)
BindingDB Entry DOI: 10.7270/Q2CV4G4R
Streptokinase A
(Streptococcus pyogenes M1 GAS)
BDBM43768
(1-(3,4-Dichloro-phenyl)-3-thiazol-2-yl-urea | 1-(3...)
Show SMILES Clc1ccc(NC(=O)Nc2nccs2)cc1Cl
Show InChI InChI=1S/C10H7Cl2N3OS/c11-7-2-1-6(5-8(7)12)14-9(16)15-10-13-3-4-17-10/h1-5H,(H2,13,14,15,16)
PCBioAssay
n/an/an/an/a 1.50E+5n/an/an/an/a
Broad Institute
Curated by PubChem BioAssay
Assay Description
Keywords: Group A streptococcus, GAS, streptokinase, expression, virulence, inhibition, dose response, EC50 Assay Overview: The goal of this assa...
PubChem Bioassay (2009)
BindingDB Entry DOI: 10.7270/Q2736PBV
G2/mitotic-specific cyclin-B1
(Homo sapiens (Human))
BDBM43768
(1-(3,4-Dichloro-phenyl)-3-thiazol-2-yl-urea | 1-(3...)
Show SMILES Clc1ccc(NC(=O)Nc2nccs2)cc1Cl
Show InChI InChI=1S/C10H7Cl2N3OS/c11-7-2-1-6(5-8(7)12)14-9(16)15-10-13-3-4-17-10/h1-5H,(H2,13,14,15,16)
NCI pathway
Reactome pathway
PCBioAssay
n/an/an/an/a>4.98E+4n/an/an/an/a
The Scripps Research Institute Molecular Screening Center
Curated by PubChem BioAssay
Assay Description
Source (MLPCN Center Name): The Scripps Research Institute Molecular Screening Center Center Affiliation: The Scripps Research Institute (TSRI) Assay...
PubChem Bioassay (2008)
BindingDB Entry DOI: 10.7270/Q2833QDB