BDBM43892 6-[2-(3,4-dihydro-2H-quinolin-1-yl)-2-keto-ethyl]-3-(4-fluorobenzyl)triazolo[4,5-d]pyrimidin-7-one::6-[2-(3,4-dihydro-2H-quinolin-1-yl)-2-oxidanylidene-ethyl]-3-[(4-fluorophenyl)methyl]-[1,2,3]triazolo[4,5-d]pyrimidin-7-one::6-[2-(3,4-dihydro-2H-quinolin-1-yl)-2-oxoethyl]-3-[(4-fluorophenyl)methyl]-7-triazolo[4,5-d]pyrimidinone::6-[2-(3,4-dihydro-2H-quinolin-1-yl)-2-oxoethyl]-3-[(4-fluorophenyl)methyl]triazolo[4,5-d]pyrimidin-7-one::VU0178663-2-D5::cid_3239682
SMILES: Fc1ccc(Cn2nnc3c2ncn(CC(=O)N2CCCc4ccccc24)c3=O)cc1
InChI Key: InChIKey=VRBFMGLGLISVTD-UHFFFAOYSA-N
Data: 1 IC50
Activity Spreadsheet -- Enzyme Inhibition Constant Data from BindingDB
Found 1 hit for monomerid = 43892
Trg + Lig
Ki
nM
ΔG°
kcal/mole
IC50
nM
Kd
nM
EC50/IC50
nM
koff
s-1
kon
M-1s-1
pHTemp
°C
electroneutral potassium-chloride cotransporter KCC2
(Homo sapiens (Human))
BDBM43892
(6-[2-(3,4-dihydro-2H-quinolin-1-yl)-2-keto-ethyl]-...)
Show SMILES Fc1ccc(Cn2nnc3c2ncn(CC(=O)N2CCCc4ccccc24)c3=O)cc1
Show InChI InChI=1S/C22H19FN6O2/c23-17-9-7-15(8-10-17)12-29-21-20(25-26-29)22(31)27(14-24-21)13-19(30)28-11-3-5-16-4-1-2-6-18(16)28/h1-2,4,6-10,14H,3,5,11-13H2
Reactome pathway
PCBioAssay
n/an/a 1.30E+3n/an/an/an/an/an/a
Vanderbilt Screening Center for GPCRs, Ion Channels and Transporters
Curated by PubChem BioAssay
Assay Description
Vanderbilt Screening Center for GPCRs, Ion Channels and Transporters Assay Provider: Eric Delpire Assay Provider Affliation: Vanderbilt University Gr...
PubChem Bioassay (2009)
BindingDB Entry DOI: 10.7270/Q2ZP44H3