BDBM43899 4-(4-methylphenyl)-N-(2-oxolanylmethyl)benzenesulfonamide::4-(4-methylphenyl)-N-(oxolan-2-ylmethyl)benzenesulfonamide::4-(p-tolyl)-N-(tetrahydrofurfuryl)benzenesulfonamide::VU0287542-2-D13::cid_2938353
SMILES: Cc1ccc(cc1)-c1ccc(cc1)S(=O)(=O)NCC1CCCO1
InChI Key: InChIKey=IHDJVVALCJTMHL-UHFFFAOYSA-N
Data: 1 IC50
Activity Spreadsheet -- Enzyme Inhibition Constant Data from BindingDB
Found 1 hit for monomerid = 43899
Trg + Lig
Ki
nM
ΔG°
kcal/mole
IC50
nM
Kd
nM
EC50/IC50
nM
koff
s-1
kon
M-1s-1
pHTemp
°C
electroneutral potassium-chloride cotransporter KCC2
(Homo sapiens (Human))
BDBM43899
(4-(4-methylphenyl)-N-(2-oxolanylmethyl)benzenesulf...)
Show SMILES Cc1ccc(cc1)-c1ccc(cc1)S(=O)(=O)NCC1CCCO1
Show InChI InChI=1S/C18H21NO3S/c1-14-4-6-15(7-5-14)16-8-10-18(11-9-16)23(20,21)19-13-17-3-2-12-22-17/h4-11,17,19H,2-3,12-13H2,1H3
Reactome pathway
PCBioAssay
n/an/a 7.70E+3n/an/an/an/an/an/a
Vanderbilt Screening Center for GPCRs, Ion Channels and Transporters
Curated by PubChem BioAssay
Assay Description
Vanderbilt Screening Center for GPCRs, Ion Channels and Transporters Assay Provider: Eric Delpire Assay Provider Affliation: Vanderbilt University Gr...
PubChem Bioassay (2009)
BindingDB Entry DOI: 10.7270/Q2ZP44H3