BDBM43907 3-chloro-1-benzothiophene-2-carboxylic acid [2-[4-[2-furanyl(oxo)methyl]-1-piperazinyl]-2-oxoethyl] ester::3-chlorobenzothiophene-2-carboxylic acid [2-[4-(2-furoyl)piperazino]-2-keto-ethyl] ester::VU0223695-2-D24::[2-[4-(furan-2-carbonyl)piperazin-1-yl]-2-oxoethyl] 3-chloro-1-benzothiophene-2-carboxylate::[2-[4-(furan-2-ylcarbonyl)piperazin-1-yl]-2-oxidanylidene-ethyl] 3-chloranyl-1-benzothiophene-2-carboxylate::cid_2335673
SMILES: Clc1c(sc2ccccc12)C(=O)OCC(=O)N1CCN(CC1)C(=O)c1ccco1
InChI Key: InChIKey=DOTBLIPQFDRGAM-UHFFFAOYSA-N
Data: 1 IC50  3 EC50
Activity Spreadsheet -- Enzyme Inhibition Constant Data from BindingDB
Found 4 hits for monomerid = 43907
Trg + Lig
Ki
nM
ΔG°
kcal/mole
IC50
nM
Kd
nM
EC50/IC50
nM
koff
s-1
kon
M-1s-1
pHTemp
°C
electroneutral potassium-chloride cotransporter KCC2
(Homo sapiens (Human))
BDBM43907
(3-chloro-1-benzothiophene-2-carboxylic acid [2-[4-...)
Show SMILES Clc1c(sc2ccccc12)C(=O)OCC(=O)N1CCN(CC1)C(=O)c1ccco1
Show InChI InChI=1S/C20H17ClN2O5S/c21-17-13-4-1-2-6-15(13)29-18(17)20(26)28-12-16(24)22-7-9-23(10-8-22)19(25)14-5-3-11-27-14/h1-6,11H,7-10,12H2
Reactome pathway
PCBioAssay
n/an/a 2.40E+4n/an/an/an/an/an/a
Vanderbilt Screening Center for GPCRs, Ion Channels and Transporters
Curated by PubChem BioAssay
Assay Description
Vanderbilt Screening Center for GPCRs, Ion Channels and Transporters Assay Provider: Eric Delpire Assay Provider Affliation: Vanderbilt University Gr...
PubChem Bioassay (2009)
BindingDB Entry DOI: 10.7270/Q2ZP44H3
electroneutral potassium-chloride cotransporter KCC2
(Homo sapiens (Human))
BDBM43907
(3-chloro-1-benzothiophene-2-carboxylic acid [2-[4-...)
Show SMILES Clc1c(sc2ccccc12)C(=O)OCC(=O)N1CCN(CC1)C(=O)c1ccco1
Show InChI InChI=1S/C20H17ClN2O5S/c21-17-13-4-1-2-6-15(13)29-18(17)20(26)28-12-16(24)22-7-9-23(10-8-22)19(25)14-5-3-11-27-14/h1-6,11H,7-10,12H2
Reactome pathway
PCBioAssay
n/an/an/an/a 1.60E+3n/an/an/an/a
Vanderbilt Screening Center for GPCRs, Ion Channels and Transporters
Curated by PubChem BioAssay
Assay Description
Vanderbilt Screening Center for GPCRs, Ion Channels and Transporters Assay Provider: Eric Delpire Assay Provider Affliation: Vanderbilt University Gr...
PubChem Bioassay (2009)
BindingDB Entry DOI: 10.7270/Q2M32T6M
electroneutral potassium-chloride cotransporter KCC2
(Homo sapiens (Human))
BDBM43907
(3-chloro-1-benzothiophene-2-carboxylic acid [2-[4-...)
Show SMILES Clc1c(sc2ccccc12)C(=O)OCC(=O)N1CCN(CC1)C(=O)c1ccco1
Show InChI InChI=1S/C20H17ClN2O5S/c21-17-13-4-1-2-6-15(13)29-18(17)20(26)28-12-16(24)22-7-9-23(10-8-22)19(25)14-5-3-11-27-14/h1-6,11H,7-10,12H2
Reactome pathway
PCBioAssay
n/an/an/an/a 599n/an/an/an/a
Vanderbilt Screening Center for GPCRs, Ion Channels and Transporters
Curated by PubChem BioAssay
Assay Description
Vanderbilt Screening Center for GPCRs, Ion Channels and Transporters Assay Provider: Eric Delpire Assay Provider Affliation: Vanderbilt University Gr...
PubChem Bioassay (2009)
BindingDB Entry DOI: 10.7270/Q2Q52N1X
electroneutral potassium-chloride cotransporter KCC2
(Homo sapiens (Human))
BDBM43907
(3-chloro-1-benzothiophene-2-carboxylic acid [2-[4-...)
Show SMILES Clc1c(sc2ccccc12)C(=O)OCC(=O)N1CCN(CC1)C(=O)c1ccco1
Show InChI InChI=1S/C20H17ClN2O5S/c21-17-13-4-1-2-6-15(13)29-18(17)20(26)28-12-16(24)22-7-9-23(10-8-22)19(25)14-5-3-11-27-14/h1-6,11H,7-10,12H2
Reactome pathway
PCBioAssay
n/an/an/an/a 478n/an/an/an/a
Vanderbilt Screening Center for GPCRs, Ion Channels and Transporters
Curated by PubChem BioAssay
Assay Description
Vanderbilt Screening Center for GPCRs, Ion Channels and Transporters Assay Provider: Eric Delpire Assay Provider Affliation: Vanderbilt University Gr...
PubChem Bioassay (2009)
BindingDB Entry DOI: 10.7270/Q2TX3CSC