BDBM43908 2-(2-methyl-1,3-thiazol-4-yl)-N-(4-phenyl-1,3-thiazol-2-yl)acetamide::2-(2-methyl-1,3-thiazol-4-yl)-N-(4-phenyl-1,3-thiazol-2-yl)ethanamide::2-(2-methyl-4-thiazolyl)-N-(4-phenyl-2-thiazolyl)acetamide::2-(2-methylthiazol-4-yl)-N-(4-phenylthiazol-2-yl)acetamide::VU0215981-2-D26::cid_2573186
SMILES: Cc1nc(CC(=O)Nc2nc(cs2)-c2ccccc2)cs1
InChI Key: InChIKey=DHDLVPZVBPEIRZ-UHFFFAOYSA-N
Data: 1 IC50  1 EC50
Activity Spreadsheet -- Enzyme Inhibition Constant Data from BindingDB
Found 2 hits for monomerid = 43908
Trg + Lig
Ki
nM
ΔG°
kcal/mole
IC50
nM
Kd
nM
EC50/IC50
nM
koff
s-1
kon
M-1s-1
pHTemp
°C
electroneutral potassium-chloride cotransporter KCC2
(Homo sapiens (Human))
BDBM43908
(2-(2-methyl-1,3-thiazol-4-yl)-N-(4-phenyl-1,3-thia...)
Show SMILES Cc1nc(CC(=O)Nc2nc(cs2)-c2ccccc2)cs1
Show InChI InChI=1S/C15H13N3OS2/c1-10-16-12(8-20-10)7-14(19)18-15-17-13(9-21-15)11-5-3-2-4-6-11/h2-6,8-9H,7H2,1H3,(H,17,18,19)
Reactome pathway
PCBioAssay
n/an/an/an/a 1.81E+3n/an/an/an/a
Vanderbilt Screening Center for GPCRs, Ion Channels and Transporters
Curated by PubChem BioAssay
Assay Description
Vanderbilt Screening Center for GPCRs, Ion Channels and Transporters Assay Provider: Eric Delpire Assay Provider Affliation: Vanderbilt University Gr...
PubChem Bioassay (2009)
BindingDB Entry DOI: 10.7270/Q2TX3CSC
electroneutral potassium-chloride cotransporter KCC2
(Homo sapiens (Human))
BDBM43908
(2-(2-methyl-1,3-thiazol-4-yl)-N-(4-phenyl-1,3-thia...)
Show SMILES Cc1nc(CC(=O)Nc2nc(cs2)-c2ccccc2)cs1
Show InChI InChI=1S/C15H13N3OS2/c1-10-16-12(8-20-10)7-14(19)18-15-17-13(9-21-15)11-5-3-2-4-6-11/h2-6,8-9H,7H2,1H3,(H,17,18,19)
Reactome pathway
PCBioAssay
n/an/a 7.90E+4n/an/an/an/an/an/a
Vanderbilt Screening Center for GPCRs, Ion Channels and Transporters
Curated by PubChem BioAssay
Assay Description
Vanderbilt Screening Center for GPCRs, Ion Channels and Transporters Assay Provider: Eric Delpire Assay Provider Affliation: Vanderbilt University Gr...
PubChem Bioassay (2009)
BindingDB Entry DOI: 10.7270/Q2ZP44H3