null
SMILES: CN[C@@H](C)C(=O)N[C@@H](C(C)C)C(=O)N1CCC[C@H]1C(=O)NNc1ccccc1
InChI Key: InChIKey=OIAFZXFQHCIAJL-XIRDDKMYSA-N
Activity Spreadsheet -- Enzyme Inhibition Constant Data from BindingDB
Found 6 hits for monomerid = 44276
Trg + Lig
Ki
nM
ΔG°
kcal/mole
IC50
nM
Kd
nM
EC50/IC50
nM
koff
s-1
kon
M-1s-1
pHTemp
°C
E3 ubiquitin-protein ligase XIAP
(Homo sapiens (Human))
BDBM44276
((2S)-N-[(1S)-1-[(2S)-2-(anilinocarbamoyl)pyrrolidi...)
Show SMILES CN[C@@H](C)C(=O)N[C@@H](C(C)C)C(=O)N1CCC[C@H]1C(=O)NNc1ccccc1
Show InChI InChI=1S/C20H31N5O3/c1-13(2)17(22-18(26)14(3)21-4)20(28)25-12-8-11-16(25)19(27)24-23-15-9-6-5-7-10-15/h5-7,9-10,13-14,16-17,21,23H,8,11-12H2,1-4H3,(H,22,26)(H,24,27)/t14-,16-,17-/m0/s1
390n/an/an/an/an/an/an/an/a
Sanford-Burnham Medical Research Institute
Curated by ChEMBL
Assay Description
Competitive inhibition of XIAP BIR2 domain by fluorescent polarization assay
Bioorg Med Chem Lett 21: 4332-6 (2011)
Article DOI: 10.1016/j.bmcl.2011.05.049
BindingDB Entry DOI: 10.7270/Q2S46SBD
E3 ubiquitin-protein ligase XIAP
(Homo sapiens (Human))
BDBM44276
((2S)-N-[(1S)-1-[(2S)-2-(anilinocarbamoyl)pyrrolidi...)
Show SMILES CN[C@@H](C)C(=O)N[C@@H](C(C)C)C(=O)N1CCC[C@H]1C(=O)NNc1ccccc1
Show InChI InChI=1S/C20H31N5O3/c1-13(2)17(22-18(26)14(3)21-4)20(28)25-12-8-11-16(25)19(27)24-23-15-9-6-5-7-10-15/h5-7,9-10,13-14,16-17,21,23H,8,11-12H2,1-4H3,(H,22,26)(H,24,27)/t14-,16-,17-/m0/s1
390n/an/an/an/an/an/an/an/a
Sanford-Burnham Medical Research Institute
Curated by ChEMBL
Assay Description
Competitive inhibition of XIAP-BIR2 domain (unknown origin) by fluorescence polarization assay
Bioorg Med Chem Lett 23: 4253-7 (2013)
Article DOI: 10.1016/j.bmcl.2013.04.096
BindingDB Entry DOI: 10.7270/Q2BC40ZK
E3 ubiquitin-protein ligase XIAP
(Homo sapiens (Human))
BDBM44276
((2S)-N-[(1S)-1-[(2S)-2-(anilinocarbamoyl)pyrrolidi...)
Show SMILES CN[C@@H](C)C(=O)N[C@@H](C(C)C)C(=O)N1CCC[C@H]1C(=O)NNc1ccccc1
Show InChI InChI=1S/C20H31N5O3/c1-13(2)17(22-18(26)14(3)21-4)20(28)25-12-8-11-16(25)19(27)24-23-15-9-6-5-7-10-15/h5-7,9-10,13-14,16-17,21,23H,8,11-12H2,1-4H3,(H,22,26)(H,24,27)/t14-,16-,17-/m0/s1
1.08E+3n/an/an/an/an/an/an/an/a
Sanford-Burnham Medical Research Institute
Curated by ChEMBL
Assay Description
Competitive inhibition of XIAP-BIR3 domain (unknown origin) by fluorescence polarization assay
Bioorg Med Chem Lett 23: 4253-7 (2013)
Article DOI: 10.1016/j.bmcl.2013.04.096
BindingDB Entry DOI: 10.7270/Q2BC40ZK
E3 ubiquitin-protein ligase XIAP
(Homo sapiens (Human))
BDBM44276
((2S)-N-[(1S)-1-[(2S)-2-(anilinocarbamoyl)pyrrolidi...)
Show SMILES CN[C@@H](C)C(=O)N[C@@H](C(C)C)C(=O)N1CCC[C@H]1C(=O)NNc1ccccc1
Show InChI InChI=1S/C20H31N5O3/c1-13(2)17(22-18(26)14(3)21-4)20(28)25-12-8-11-16(25)19(27)24-23-15-9-6-5-7-10-15/h5-7,9-10,13-14,16-17,21,23H,8,11-12H2,1-4H3,(H,22,26)(H,24,27)/t14-,16-,17-/m0/s1
1.08E+3n/an/an/an/an/an/an/an/a
Sanford-Burnham Medical Research Institute
Curated by ChEMBL
Assay Description
Competitive inhibition of XIAP BIR3 domain by fluorescent polarization assay
Bioorg Med Chem Lett 21: 4332-6 (2011)
Article DOI: 10.1016/j.bmcl.2011.05.049
BindingDB Entry DOI: 10.7270/Q2S46SBD
E3 ubiquitin-protein ligase XIAP
(Homo sapiens (Human))
BDBM44276
((2S)-N-[(1S)-1-[(2S)-2-(anilinocarbamoyl)pyrrolidi...)
Show SMILES CN[C@@H](C)C(=O)N[C@@H](C(C)C)C(=O)N1CCC[C@H]1C(=O)NNc1ccccc1
Show InChI InChI=1S/C20H31N5O3/c1-13(2)17(22-18(26)14(3)21-4)20(28)25-12-8-11-16(25)19(27)24-23-15-9-6-5-7-10-15/h5-7,9-10,13-14,16-17,21,23H,8,11-12H2,1-4H3,(H,22,26)(H,24,27)/t14-,16-,17-/m0/s1
PCBioAssay
n/an/a 2.90E+3n/an/an/an/an/an/a
Burnham Center for Chemical Genomics
Curated by PubChem BioAssay
Assay Description
Data Source: Sanford-Burnham Center for Chemical Genomics (SBCCG) Source Affiliation: Sanford-Burnham Medical Research Institute (SBMRI, San Diego, C...
PubChem Bioassay (2009)
BindingDB Entry DOI: 10.7270/Q29W0CWK
E3 ubiquitin-protein ligase XIAP
(Homo sapiens (Human))
BDBM44276
((2S)-N-[(1S)-1-[(2S)-2-(anilinocarbamoyl)pyrrolidi...)
Show SMILES CN[C@@H](C)C(=O)N[C@@H](C(C)C)C(=O)N1CCC[C@H]1C(=O)NNc1ccccc1
Show InChI InChI=1S/C20H31N5O3/c1-13(2)17(22-18(26)14(3)21-4)20(28)25-12-8-11-16(25)19(27)24-23-15-9-6-5-7-10-15/h5-7,9-10,13-14,16-17,21,23H,8,11-12H2,1-4H3,(H,22,26)(H,24,27)/t14-,16-,17-/m0/s1
PCBioAssay
n/an/a 1.30E+3n/an/an/an/an/an/a
Burnham Center for Chemical Genomics
Curated by PubChem BioAssay
Assay Description
Data Source: Sanford-Burnham Center for Chemical Genomics (SBCCG) Source Affiliation: Sanford-Burnham Medical Research Institute (SBMRI, San Diego, C...
PubChem Bioassay (2009)
BindingDB Entry DOI: 10.7270/Q2FN14KV