BDBM442794 MPI9
SMILES: CC(C)C[C@H](NC(=O)[C@@H](NC(=O)\C=C\c1ccc(Cl)cc1F)C(C)C)C(=O)N[C@@H](C[C@@H]1CCNC1=O)C=O
InChI Key: InChIKey=BLKJSUVYKJMKNN-ZHRPPPACSA-N
Data: 1 KI  1 IC50
Activity Spreadsheet -- Enzyme Inhibition Constant Data from BindingDB
Found 1 hit for monomerid = 442794
Trg + Lig
Ki
nM
ΔG°
kcal/mole
IC50
nM
Kd
nM
EC50/IC50
nM
koff
s-1
kon
M-1s-1
pHTemp
°C
Replicase polyprotein 1ab
(2019-nCoV)
BDBM442794
(MPI9)
Show SMILES CC(C)C[C@H](NC(=O)[C@@H](NC(=O)\C=C\c1ccc(Cl)cc1F)C(C)C)C(=O)N[C@@H](C[C@@H]1CCNC1=O)C=O
Show InChI InChI=1S/C27H36ClFN4O5/c1-15(2)11-22(26(37)31-20(14-34)12-18-9-10-30-25(18)36)32-27(38)24(16(3)4)33-23(35)8-6-17-5-7-19(28)13-21(17)29/h5-8,13-16,18,20,22,24H,9-12H2,1-4H3,(H,30,36)(H,31,37)(H,32,38)(H,33,35)/b8-6+/t18-,20-,22-,24-/m0/s1
NCI pathway
Reactome pathway
55n/a 56n/an/an/an/an/an/a
Texas A&M University
Assay Description
The assays were carried out with 20 nM enzyme (except for MPI3, for which 10 nM enzyme was used) and 10 μM substrate at 37oC with continuous sha...
ChemMedChem (2020)
Article DOI: 10.1002/cmdc.202000924