BDBM444423 US10662159, Example 8
SMILES: FC(F)(F)C(OC(=O)N1Cc2ccc(Br)cc2C1)C(F)(F)F
InChI Key: InChIKey=HNGMUSFXUWVIKF-UHFFFAOYSA-N
Data: 4 IC50
Activity Spreadsheet -- Enzyme Inhibition Constant Data from BindingDB
Found 4 hits for monomerid = 444423
Trg + Lig
Ki
nM
ΔG°
kcal/mole
IC50
nM
Kd
nM
EC50/IC50
nM
koff
s-1
kon
M-1s-1
pHTemp
°C
Monoacylglycerol lipase ABHD6
(Homo sapiens (Human))
BDBM444423
(US10662159, Example 8)
Show SMILES FC(F)(F)C(OC(=O)N1Cc2ccc(Br)cc2C1)C(F)(F)F
Show InChI InChI=1S/C12H8BrF6NO2/c13-8-2-1-6-4-20(5-7(6)3-8)10(21)22-9(11(14,15)16)12(17,18)19/h1-3,9H,4-5H2
US Patent
n/an/a 55n/an/an/an/an/an/a
MAKSCIENTIFIC, LLC
US Patent
Assay Description
ABHD6: Certain compounds were tested for their ABHD6 and dual ABHD6/MGL inhibitory activity, which is expressed as % of inhibition or IC50 values. Th...
US Patent US10662159 (2020)
Fatty-acid amide hydrolase 1 (aa 30-579)
(Rattus norvegicus (rat))
BDBM444423
(US10662159, Example 8)
Show SMILES FC(F)(F)C(OC(=O)N1Cc2ccc(Br)cc2C1)C(F)(F)F
Show InChI InChI=1S/C12H8BrF6NO2/c13-8-2-1-6-4-20(5-7(6)3-8)10(21)22-9(11(14,15)16)12(17,18)19/h1-3,9H,4-5H2
US Patent
n/an/a>1.00E+3n/an/an/an/an/an/a
MAKSCIENTIFIC, LLC
US Patent
Assay Description
hABHD6:Initial Fluorescent Inhibition Assay (3-Point)—In each well of a 96-well plate 8 μL of membrane fraction containing full-length hABHD6 (1...
US Patent US10662159 (2020)
Fatty-acid amide hydrolase 1
(Homo sapiens (Human))
BDBM444423
(US10662159, Example 8)
Show SMILES FC(F)(F)C(OC(=O)N1Cc2ccc(Br)cc2C1)C(F)(F)F
Show InChI InChI=1S/C12H8BrF6NO2/c13-8-2-1-6-4-20(5-7(6)3-8)10(21)22-9(11(14,15)16)12(17,18)19/h1-3,9H,4-5H2
US Patent
n/an/a>1.00E+3n/an/an/an/an/an/a
MAKSCIENTIFIC, LLC
US Patent
Assay Description
Rat/homo FAAH:Procedure was followed as described for hMGL, except that arachidonoyl-methyl coumarin (was used as fluorigenic substrate. Compounds we...
US Patent US10662159 (2020)
Monoglyceride lipase
(Homo sapiens (Human))
BDBM444423
(US10662159, Example 8)
Show SMILES FC(F)(F)C(OC(=O)N1Cc2ccc(Br)cc2C1)C(F)(F)F
Show InChI InChI=1S/C12H8BrF6NO2/c13-8-2-1-6-4-20(5-7(6)3-8)10(21)22-9(11(14,15)16)12(17,18)19/h1-3,9H,4-5H2
Reactome pathway
US Patent
n/an/a>1.00E+3n/an/an/an/an/an/a
MAKSCIENTIFIC, LLC
US Patent
Assay Description
MGL: Compound inhibition of hMGL activity was assessed by a fluorometric assay recently developed in our laboratory (Makriyannis et al WO Patent Appl...
US Patent US10662159 (2020)