BDBM444432 US10662159, Example 17
SMILES: FC(F)(F)C(OC(=O)N1CCc2cc(Br)ccc2C1)C(F)(F)F
InChI Key: InChIKey=QNNLSVRDDCVIGF-UHFFFAOYSA-N
Data: 4 IC50
Activity Spreadsheet -- Enzyme Inhibition Constant Data from BindingDB
Found 4 hits for monomerid = 444432
Trg + Lig
Ki
nM
ΔG°
kcal/mole
IC50
nM
Kd
nM
EC50/IC50
nM
koff
s-1
kon
M-1s-1
pHTemp
°C
Monoacylglycerol lipase ABHD6
(Homo sapiens (Human))
BDBM444432
(US10662159, Example 17)
Show SMILES FC(F)(F)C(OC(=O)N1CCc2cc(Br)ccc2C1)C(F)(F)F
Show InChI InChI=1S/C13H10BrF6NO2/c14-9-2-1-8-6-21(4-3-7(8)5-9)11(22)23-10(12(15,16)17)13(18,19)20/h1-2,5,10H,3-4,6H2
US Patent
n/an/a 55n/an/an/an/an/an/a
MAKSCIENTIFIC, LLC
US Patent
Assay Description
ABHD6: Certain compounds were tested for their ABHD6 and dual ABHD6/MGL inhibitory activity, which is expressed as % of inhibition or IC50 values. Th...
US Patent US10662159 (2020)
Fatty-acid amide hydrolase 1 (aa 30-579)
(Rattus norvegicus (rat))
BDBM444432
(US10662159, Example 17)
Show SMILES FC(F)(F)C(OC(=O)N1CCc2cc(Br)ccc2C1)C(F)(F)F
Show InChI InChI=1S/C13H10BrF6NO2/c14-9-2-1-8-6-21(4-3-7(8)5-9)11(22)23-10(12(15,16)17)13(18,19)20/h1-2,5,10H,3-4,6H2
US Patent
n/an/a>1.00E+3n/an/an/an/an/an/a
MAKSCIENTIFIC, LLC
US Patent
Assay Description
hABHD6:Initial Fluorescent Inhibition Assay (3-Point)—In each well of a 96-well plate 8 μL of membrane fraction containing full-length hABHD6 (1...
US Patent US10662159 (2020)
Fatty-acid amide hydrolase 1
(Homo sapiens (Human))
BDBM444432
(US10662159, Example 17)
Show SMILES FC(F)(F)C(OC(=O)N1CCc2cc(Br)ccc2C1)C(F)(F)F
Show InChI InChI=1S/C13H10BrF6NO2/c14-9-2-1-8-6-21(4-3-7(8)5-9)11(22)23-10(12(15,16)17)13(18,19)20/h1-2,5,10H,3-4,6H2
US Patent
n/an/a>1.00E+3n/an/an/an/an/an/a
MAKSCIENTIFIC, LLC
US Patent
Assay Description
Rat/homo FAAH:Procedure was followed as described for hMGL, except that arachidonoyl-methyl coumarin (was used as fluorigenic substrate. Compounds we...
US Patent US10662159 (2020)
Monoglyceride lipase
(Homo sapiens (Human))
BDBM444432
(US10662159, Example 17)
Show SMILES FC(F)(F)C(OC(=O)N1CCc2cc(Br)ccc2C1)C(F)(F)F
Show InChI InChI=1S/C13H10BrF6NO2/c14-9-2-1-8-6-21(4-3-7(8)5-9)11(22)23-10(12(15,16)17)13(18,19)20/h1-2,5,10H,3-4,6H2
Reactome pathway
US Patent
n/an/a>1.00E+3n/an/an/an/an/an/a
MAKSCIENTIFIC, LLC
US Patent
Assay Description
MGL: Compound inhibition of hMGL activity was assessed by a fluorometric assay recently developed in our laboratory (Makriyannis et al WO Patent Appl...
US Patent US10662159 (2020)