BDBM444440 US10662159, Example 25
SMILES: FC(F)(F)C(OC(=O)N1Cc2ccc(cc2C1)-c1ccccc1)C(F)(F)F
InChI Key: InChIKey=CEIXXPVHWOLVPN-UHFFFAOYSA-N
Data: 3 IC50
Activity Spreadsheet -- Enzyme Inhibition Constant Data from BindingDB
Found 3 hits for monomerid = 444440
Trg + Lig
Ki
nM
ΔG°
kcal/mole
IC50
nM
Kd
nM
EC50/IC50
nM
koff
s-1
kon
M-1s-1
pHTemp
°C
Monoacylglycerol lipase ABHD6
(Homo sapiens (Human))
BDBM444440
(US10662159, Example 25)
Show SMILES FC(F)(F)C(OC(=O)N1Cc2ccc(cc2C1)-c1ccccc1)C(F)(F)F
Show InChI InChI=1S/C18H13F6NO2/c19-17(20,21)15(18(22,23)24)27-16(26)25-9-13-7-6-12(8-14(13)10-25)11-4-2-1-3-5-11/h1-8,15H,9-10H2
US Patent
n/an/a 55n/an/an/an/an/an/a
MAKSCIENTIFIC, LLC
US Patent
Assay Description
ABHD6: Certain compounds were tested for their ABHD6 and dual ABHD6/MGL inhibitory activity, which is expressed as % of inhibition or IC50 values. Th...
US Patent US10662159 (2020)
Fatty-acid amide hydrolase 1
(Homo sapiens (Human))
BDBM444440
(US10662159, Example 25)
Show SMILES FC(F)(F)C(OC(=O)N1Cc2ccc(cc2C1)-c1ccccc1)C(F)(F)F
Show InChI InChI=1S/C18H13F6NO2/c19-17(20,21)15(18(22,23)24)27-16(26)25-9-13-7-6-12(8-14(13)10-25)11-4-2-1-3-5-11/h1-8,15H,9-10H2
US Patent
n/an/a>1.00E+3n/an/an/an/an/an/a
MAKSCIENTIFIC, LLC
US Patent
Assay Description
Rat/homo FAAH:Procedure was followed as described for hMGL, except that arachidonoyl-methyl coumarin (was used as fluorigenic substrate. Compounds we...
US Patent US10662159 (2020)
Monoglyceride lipase
(Homo sapiens (Human))
BDBM444440
(US10662159, Example 25)
Show SMILES FC(F)(F)C(OC(=O)N1Cc2ccc(cc2C1)-c1ccccc1)C(F)(F)F
Show InChI InChI=1S/C18H13F6NO2/c19-17(20,21)15(18(22,23)24)27-16(26)25-9-13-7-6-12(8-14(13)10-25)11-4-2-1-3-5-11/h1-8,15H,9-10H2
Reactome pathway
US Patent
n/an/a>1.00E+3n/an/an/an/an/an/a
MAKSCIENTIFIC, LLC
US Patent
Assay Description
MGL: Compound inhibition of hMGL activity was assessed by a fluorometric assay recently developed in our laboratory (Makriyannis et al WO Patent Appl...
US Patent US10662159 (2020)