BDBM444448 US10662159, Example 35
SMILES: CC1(C)C2C1C(=O)N(OC(=O)N1CCc3c(Br)cccc3C1)C2=O
InChI Key: InChIKey=PEICHOKVKQMSKU-UHFFFAOYSA-N
Data: 3 IC50
Activity Spreadsheet -- Enzyme Inhibition Constant Data from BindingDB
Found 3 hits for monomerid = 444448
Trg + Lig
Ki
nM
ΔG°
kcal/mole
IC50
nM
Kd
nM
EC50/IC50
nM
koff
s-1
kon
M-1s-1
pHTemp
°C
Monoacylglycerol lipase ABHD6
(Homo sapiens (Human))
BDBM444448
(US10662159, Example 35)
Show SMILES CC1(C)C2C1C(=O)N(OC(=O)N1CCc3c(Br)cccc3C1)C2=O
Show InChI InChI=1S/C17H17BrN2O4/c1-17(2)12-13(17)15(22)20(14(12)21)24-16(23)19-7-6-10-9(8-19)4-3-5-11(10)18/h3-5,12-13H,6-8H2,1-2H3
US Patent
n/an/a 55n/an/an/an/an/an/a
MAKSCIENTIFIC, LLC
US Patent
Assay Description
ABHD6: Certain compounds were tested for their ABHD6 and dual ABHD6/MGL inhibitory activity, which is expressed as % of inhibition or IC50 values. Th...
US Patent US10662159 (2020)
Fatty-acid amide hydrolase 1
(Homo sapiens (Human))
BDBM444448
(US10662159, Example 35)
Show SMILES CC1(C)C2C1C(=O)N(OC(=O)N1CCc3c(Br)cccc3C1)C2=O
Show InChI InChI=1S/C17H17BrN2O4/c1-17(2)12-13(17)15(22)20(14(12)21)24-16(23)19-7-6-10-9(8-19)4-3-5-11(10)18/h3-5,12-13H,6-8H2,1-2H3
US Patent
n/an/a>1.00E+3n/an/an/an/an/an/a
MAKSCIENTIFIC, LLC
US Patent
Assay Description
Rat/homo FAAH:Procedure was followed as described for hMGL, except that arachidonoyl-methyl coumarin (was used as fluorigenic substrate. Compounds we...
US Patent US10662159 (2020)
Monoglyceride lipase
(Homo sapiens (Human))
BDBM444448
(US10662159, Example 35)
Show SMILES CC1(C)C2C1C(=O)N(OC(=O)N1CCc3c(Br)cccc3C1)C2=O
Show InChI InChI=1S/C17H17BrN2O4/c1-17(2)12-13(17)15(22)20(14(12)21)24-16(23)19-7-6-10-9(8-19)4-3-5-11(10)18/h3-5,12-13H,6-8H2,1-2H3
Reactome pathway
US Patent
n/an/a>1.00E+3n/an/an/an/an/an/a
MAKSCIENTIFIC, LLC
US Patent
Assay Description
MGL: Compound inhibition of hMGL activity was assessed by a fluorometric assay recently developed in our laboratory (Makriyannis et al WO Patent Appl...
US Patent US10662159 (2020)