null
SMILES: Cc1nnn(C)c1-c1ccc2c(c1)n([C@@H](C1CCOCC1)c1ccccc1)c1cc(cnc21)C(C)(C)O
InChI Key: InChIKey=LHUPUFVIXSYKRE-GDLZYMKVSA-N
Activity Spreadsheet -- Enzyme Inhibition Constant Data from BindingDB
Found 3 hits for monomerid = 445524
Trg + Lig
Ki
nM
ΔG°
kcal/mole
IC50
nM
Kd
nM
EC50/IC50
nM
koff
s-1
kon
M-1s-1
pHTemp
°C
Bromodomain-containing protein 4 [1-477]
(Homo sapiens (Human))
BDBM445524
(2-{7-[4-(2H3)Methyl-1-methyl-1H-1,2,3-triazol-5-yl...)
Show SMILES Cc1nnn(C)c1-c1ccc2c(c1)n([C@@H](C1CCOCC1)c1ccccc1)c1cc(cnc21)C(C)(C)O
Show InChI InChI=1S/C30H33N5O2/c1-19-28(34(4)33-32-19)22-10-11-24-25(16-22)35(26-17-23(30(2,3)36)18-31-27(24)26)29(20-8-6-5-7-9-20)21-12-14-37-15-13-21/h5-11,16-18,21,29,36H,12-15H2,1-4H3/t29-/m1/s1
US Patent
n/an/a<5n/an/an/an/an/an/a
Bristol-Myers Squibb Company
US Patent
Assay Description
All assay components were dissolved in buffer composition 20 mM Hepes pH 7.5, 150 mM NaCl, 5 mM DTT, 0.005% Tween 20, and 100 ug/ml BSA for BRD4 (1-4...
US Patent US10683290 (2020)
BindingDB Entry DOI: 10.7270/Q25D8VWB
Bromodomain-containing protein 4
(Homo sapiens (Human))
BDBM445524
(2-{7-[4-(2H3)Methyl-1-methyl-1H-1,2,3-triazol-5-yl...)
Show SMILES Cc1nnn(C)c1-c1ccc2c(c1)n([C@@H](C1CCOCC1)c1ccccc1)c1cc(cnc21)C(C)(C)O
Show InChI InChI=1S/C30H33N5O2/c1-19-28(34(4)33-32-19)22-10-11-24-25(16-22)35(26-17-23(30(2,3)36)18-31-27(24)26)29(20-8-6-5-7-9-20)21-12-14-37-15-13-21/h5-11,16-18,21,29,36H,12-15H2,1-4H3/t29-/m1/s1
n/an/a 0.600n/an/an/an/an/an/a
TBA
Assay Description
Inhibition of BRD4 (unknown origin)
Citation and Details
Article DOI: 10.1016/j.bmcl.2021.128376
BindingDB Entry DOI: 10.7270/Q2KS6WD7
Myc proto-oncogene protein
(Homo sapiens (Human))
BDBM445524
(2-{7-[4-(2H3)Methyl-1-methyl-1H-1,2,3-triazol-5-yl...)
Show SMILES Cc1nnn(C)c1-c1ccc2c(c1)n([C@@H](C1CCOCC1)c1ccccc1)c1cc(cnc21)C(C)(C)O
Show InChI InChI=1S/C30H33N5O2/c1-19-28(34(4)33-32-19)22-10-11-24-25(16-22)35(26-17-23(30(2,3)36)18-31-27(24)26)29(20-8-6-5-7-9-20)21-12-14-37-15-13-21/h5-11,16-18,21,29,36H,12-15H2,1-4H3/t29-/m1/s1
Reactome pathway
n/an/a 0.200n/an/an/an/an/an/a
TBA
Assay Description
Inhibition of c-MYC (unknown origin)
Citation and Details
Article DOI: 10.1016/j.bmcl.2021.128376
BindingDB Entry DOI: 10.7270/Q2KS6WD7