BDBM4534 4-Phenylamino-3-quinolinecarbonitrile deriv. 1l::4-[(2-Chloro-5-ethoxy-4-methylphenyl)amino]-6,7-dimethoxy-3-quinolinecarbonitrile::4-[(2-chloro-5-methoxy-4-methylphenyl)amino]-6,7-dimethoxyquinoline-3-carbonitrile
SMILES: COc1cc(Nc2c(cnc3cc(OC)c(OC)cc23)C#N)c(Cl)cc1C
InChI Key: InChIKey=LXJWUNONOVIADV-UHFFFAOYSA-N
Data: 1 IC50
Activity Spreadsheet -- Enzyme Inhibition Constant Data from BindingDB
Found 1 hit for monomerid = 4534
Trg + Lig
Ki
nM
ΔG°
kcal/mole
IC50
nM
Kd
nM
EC50/IC50
nM
koff
s-1
kon
M-1s-1
pHTemp
°C
Proto-oncogene tyrosine-protein kinase Src
(Homo sapiens (Human))
BDBM4534
(4-Phenylamino-3-quinolinecarbonitrile deriv. 1l | ...)
Show SMILES COc1cc(Nc2c(cnc3cc(OC)c(OC)cc23)C#N)c(Cl)cc1C
Show InChI InChI=1S/C20H18ClN3O3/c1-11-5-14(21)16(8-17(11)25-2)24-20-12(9-22)10-23-15-7-19(27-4)18(26-3)6-13(15)20/h5-8,10H,1-4H3,(H,23,24)
n/an/a 2.90n/an/an/an/a7.530
Wyeth-Ayerst Research
Assay Description
Src kinase activity was measured in an ELISA format. IC50 is the inhibitor concentration which inhibits 50% of kinase activity that catalyzes the tra...
J Med Chem 44: 3965-77 (2001)
Article DOI: 10.1021/jm0102250
BindingDB Entry DOI: 10.7270/Q2TD9VHP