BDBM458139 US10752615, Compound 31
SMILES: Nc1ccc(cn1)-c1ccc(s1)C(=O)Nc1nc2ccccc2n1[C@H]1C[C@]2(C1)CCN(C2)C(=O)C=C
InChI Key: InChIKey=KKDKMWVZUKAQOJ-TULSRQJMSA-N
Data: 4 IC50
Activity Spreadsheet -- Enzyme Inhibition Constant Data from BindingDB
Found 4 hits for monomerid = 458139
Trg + Lig
Ki
nM
ΔG°
kcal/mole
IC50
nM
Kd
nM
EC50/IC50
nM
koff
s-1
kon
M-1s-1
pHTemp
°C
Tyrosine-protein kinase ITK/TSK
(Homo sapiens (Human))
BDBM458139
(US10752615, Compound 31)
Show SMILES Nc1ccc(cn1)-c1ccc(s1)C(=O)Nc1nc2ccccc2n1[C@H]1C[C@]2(C1)CCN(C2)C(=O)C=C |r,wU:24.27,26.30,(8.3,1.5,;6.96,2.27,;5.63,1.5,;4.29,2.27,;4.29,3.81,;5.63,4.58,;6.96,3.81,;2.96,4.58,;2.96,6.12,;1.5,6.6,;.59,5.35,;1.5,4.11,;-.95,5.35,;-1.72,6.68,;-1.72,4.02,;-3.26,4.02,;-4.16,5.26,;-5.63,4.79,;-6.96,5.56,;-8.3,4.79,;-8.3,3.25,;-6.96,2.48,;-5.63,3.25,;-4.16,2.77,;-3.77,1.28,;-2.43,.51,;-3.2,-.82,;-4.54,-.05,;-1.74,-1.3,;-1.74,-2.84,;-3.2,-3.31,;-4.11,-2.07,;-3.6,-4.8,;-2.51,-5.89,;-5.09,-5.2,;-5.49,-6.68,)|
Show InChI InChI=1S/C27H26N6O2S/c1-2-24(34)32-12-11-27(16-32)13-18(14-27)33-20-6-4-3-5-19(20)30-26(33)31-25(35)22-9-8-21(36-22)17-7-10-23(28)29-15-17/h2-10,15,18H,1,11-14,16H2,(H2,28,29)(H,30,31,35)/t18-,27-
Reactome pathway
US Patent
n/an/a 3.08n/an/an/an/an/an/a
GB005, Inc.
US Patent
Assay Description
The in vitro kinase assays were performed at Nanosyn (Santa Clara, Calif.) utilizing microfluidic detection technology. The test compounds were seria...
US Patent US10752615 (2020)
Tyrosine-protein kinase TEC
(Homo sapiens (Human))
BDBM458139
(US10752615, Compound 31)
Show SMILES Nc1ccc(cn1)-c1ccc(s1)C(=O)Nc1nc2ccccc2n1[C@H]1C[C@]2(C1)CCN(C2)C(=O)C=C |r,wU:24.27,26.30,(8.3,1.5,;6.96,2.27,;5.63,1.5,;4.29,2.27,;4.29,3.81,;5.63,4.58,;6.96,3.81,;2.96,4.58,;2.96,6.12,;1.5,6.6,;.59,5.35,;1.5,4.11,;-.95,5.35,;-1.72,6.68,;-1.72,4.02,;-3.26,4.02,;-4.16,5.26,;-5.63,4.79,;-6.96,5.56,;-8.3,4.79,;-8.3,3.25,;-6.96,2.48,;-5.63,3.25,;-4.16,2.77,;-3.77,1.28,;-2.43,.51,;-3.2,-.82,;-4.54,-.05,;-1.74,-1.3,;-1.74,-2.84,;-3.2,-3.31,;-4.11,-2.07,;-3.6,-4.8,;-2.51,-5.89,;-5.09,-5.2,;-5.49,-6.68,)|
Show InChI InChI=1S/C27H26N6O2S/c1-2-24(34)32-12-11-27(16-32)13-18(14-27)33-20-6-4-3-5-19(20)30-26(33)31-25(35)22-9-8-21(36-22)17-7-10-23(28)29-15-17/h2-10,15,18H,1,11-14,16H2,(H2,28,29)(H,30,31,35)/t18-,27-
Reactome pathway
US Patent
n/an/a 1.25n/an/an/an/an/an/a
GB005, Inc.
US Patent
Assay Description
The in vitro kinase assays were performed at Nanosyn (Santa Clara, Calif.) utilizing microfluidic detection technology. The test compounds were seria...
US Patent US10752615 (2020)
Tyrosine-protein kinase BTK
(Homo sapiens (Human))
BDBM458139
(US10752615, Compound 31)
Show SMILES Nc1ccc(cn1)-c1ccc(s1)C(=O)Nc1nc2ccccc2n1[C@H]1C[C@]2(C1)CCN(C2)C(=O)C=C |r,wU:24.27,26.30,(8.3,1.5,;6.96,2.27,;5.63,1.5,;4.29,2.27,;4.29,3.81,;5.63,4.58,;6.96,3.81,;2.96,4.58,;2.96,6.12,;1.5,6.6,;.59,5.35,;1.5,4.11,;-.95,5.35,;-1.72,6.68,;-1.72,4.02,;-3.26,4.02,;-4.16,5.26,;-5.63,4.79,;-6.96,5.56,;-8.3,4.79,;-8.3,3.25,;-6.96,2.48,;-5.63,3.25,;-4.16,2.77,;-3.77,1.28,;-2.43,.51,;-3.2,-.82,;-4.54,-.05,;-1.74,-1.3,;-1.74,-2.84,;-3.2,-3.31,;-4.11,-2.07,;-3.6,-4.8,;-2.51,-5.89,;-5.09,-5.2,;-5.49,-6.68,)|
Show InChI InChI=1S/C27H26N6O2S/c1-2-24(34)32-12-11-27(16-32)13-18(14-27)33-20-6-4-3-5-19(20)30-26(33)31-25(35)22-9-8-21(36-22)17-7-10-23(28)29-15-17/h2-10,15,18H,1,11-14,16H2,(H2,28,29)(H,30,31,35)/t18-,27-
NCI pathway
Reactome pathway
US Patent
n/an/a 5.38n/an/an/an/an/an/a
GB005, Inc.
US Patent
Assay Description
The in vitro kinase assays were performed at Nanosyn (Santa Clara, Calif.) utilizing microfluidic detection technology. The test compounds were seria...
US Patent US10752615 (2020)
Tyrosine-protein kinase TXK
(Homo sapiens (Human))
BDBM458139
(US10752615, Compound 31)
Show SMILES Nc1ccc(cn1)-c1ccc(s1)C(=O)Nc1nc2ccccc2n1[C@H]1C[C@]2(C1)CCN(C2)C(=O)C=C |r,wU:24.27,26.30,(8.3,1.5,;6.96,2.27,;5.63,1.5,;4.29,2.27,;4.29,3.81,;5.63,4.58,;6.96,3.81,;2.96,4.58,;2.96,6.12,;1.5,6.6,;.59,5.35,;1.5,4.11,;-.95,5.35,;-1.72,6.68,;-1.72,4.02,;-3.26,4.02,;-4.16,5.26,;-5.63,4.79,;-6.96,5.56,;-8.3,4.79,;-8.3,3.25,;-6.96,2.48,;-5.63,3.25,;-4.16,2.77,;-3.77,1.28,;-2.43,.51,;-3.2,-.82,;-4.54,-.05,;-1.74,-1.3,;-1.74,-2.84,;-3.2,-3.31,;-4.11,-2.07,;-3.6,-4.8,;-2.51,-5.89,;-5.09,-5.2,;-5.49,-6.68,)|
Show InChI InChI=1S/C27H26N6O2S/c1-2-24(34)32-12-11-27(16-32)13-18(14-27)33-20-6-4-3-5-19(20)30-26(33)31-25(35)22-9-8-21(36-22)17-7-10-23(28)29-15-17/h2-10,15,18H,1,11-14,16H2,(H2,28,29)(H,30,31,35)/t18-,27-
US Patent
n/an/a 1.03n/an/an/an/an/an/a
GB005, Inc.
US Patent
Assay Description
The in vitro kinase assays were performed at Nanosyn (Santa Clara, Calif.) utilizing microfluidic detection technology. The test compounds were seria...
US Patent US10752615 (2020)