null
SMILES: CC(C)c1ccc(cc1)-c1cc([nH]n1)C(O)=O
InChI Key: InChIKey=PCZGIQISGVTTCE-UHFFFAOYSA-N
Activity Spreadsheet -- Enzyme Inhibition Constant Data from BindingDB
Found 5 hits for monomerid = 45816
Trg + Lig
Ki
nM
ΔG°
kcal/mole
IC50
nM
Kd
nM
EC50/IC50
nM
koff
s-1
kon
M-1s-1
pHTemp
°C
Carbonic anhydrase 1
(Homo sapiens (Human))
BDBM45816
(3-(4-propan-2-ylphenyl)-1H-pyrazole-5-carboxylic a...)
Show SMILES CC(C)c1ccc(cc1)-c1cc([nH]n1)C(O)=O
Show InChI InChI=1S/C13H14N2O2/c1-8(2)9-3-5-10(6-4-9)11-7-12(13(16)17)15-14-11/h3-8H,1-2H3,(H,14,15)(H,16,17)
NCI pathway
Reactome pathway
>5.00E+4n/an/an/an/an/an/an/an/a
University of Belgrade
Curated by ChEMBL
Assay Description
Inhibition of human recombinant carbonic anhydrase 1 expressed in Escherichia coli preincubated for 15 mins by stopped flow CO2 hydration method
Bioorg Med Chem 23: 4649-59 (2015)
Article DOI: 10.1016/j.bmc.2015.05.052
BindingDB Entry DOI: 10.7270/Q2X068SW
Carbonic anhydrase 2
(Homo sapiens (Human))
BDBM45816
(3-(4-propan-2-ylphenyl)-1H-pyrazole-5-carboxylic a...)
Show SMILES CC(C)c1ccc(cc1)-c1cc([nH]n1)C(O)=O
Show InChI InChI=1S/C13H14N2O2/c1-8(2)9-3-5-10(6-4-9)11-7-12(13(16)17)15-14-11/h3-8H,1-2H3,(H,14,15)(H,16,17)
Reactome pathway
>5.00E+4n/an/an/an/an/an/an/an/a
University of Belgrade
Curated by ChEMBL
Assay Description
Inhibition of human recombinant carbonic anhydrase 2 expressed in Escherichia coli preincubated for 15 mins by stopped flow CO2 hydration method
Bioorg Med Chem 23: 4649-59 (2015)
Article DOI: 10.1016/j.bmc.2015.05.052
BindingDB Entry DOI: 10.7270/Q2X068SW
Carbonic anhydrase 12
(Homo sapiens (Human))
BDBM45816
(3-(4-propan-2-ylphenyl)-1H-pyrazole-5-carboxylic a...)
Show SMILES CC(C)c1ccc(cc1)-c1cc([nH]n1)C(O)=O
Show InChI InChI=1S/C13H14N2O2/c1-8(2)9-3-5-10(6-4-9)11-7-12(13(16)17)15-14-11/h3-8H,1-2H3,(H,14,15)(H,16,17)
Reactome pathway
>5.00E+4n/an/an/an/an/an/an/an/a
University of Belgrade
Curated by ChEMBL
Assay Description
Inhibition of human recombinant carbonic anhydrase 12 expressed in Escherichia coli preincubated for 15 mins by stopped flow CO2 hydration method
Bioorg Med Chem 23: 4649-59 (2015)
Article DOI: 10.1016/j.bmc.2015.05.052
BindingDB Entry DOI: 10.7270/Q2X068SW
Carbonic anhydrase 9
(Homo sapiens (Human))
BDBM45816
(3-(4-propan-2-ylphenyl)-1H-pyrazole-5-carboxylic a...)
Show SMILES CC(C)c1ccc(cc1)-c1cc([nH]n1)C(O)=O
Show InChI InChI=1S/C13H14N2O2/c1-8(2)9-3-5-10(6-4-9)11-7-12(13(16)17)15-14-11/h3-8H,1-2H3,(H,14,15)(H,16,17)
NCI pathway
Reactome pathway
>5.00E+4n/an/an/an/an/an/an/an/a
University of Belgrade
Curated by ChEMBL
Assay Description
Inhibition of human recombinant carbonic anhydrase 9 expressed in Escherichia coli preincubated for 15 mins by stopped flow CO2 hydration method
Bioorg Med Chem 23: 4649-59 (2015)
Article DOI: 10.1016/j.bmc.2015.05.052
BindingDB Entry DOI: 10.7270/Q2X068SW
Alkaline phosphatase, tissue-nonspecific isozyme
(Homo sapiens (Human))
BDBM45816
(3-(4-propan-2-ylphenyl)-1H-pyrazole-5-carboxylic a...)
Show SMILES CC(C)c1ccc(cc1)-c1cc([nH]n1)C(O)=O
Show InChI InChI=1S/C13H14N2O2/c1-8(2)9-3-5-10(6-4-9)11-7-12(13(16)17)15-14-11/h3-8H,1-2H3,(H,14,15)(H,16,17)
PCBioAssay
n/an/a>1.00E+5n/an/an/an/an/an/a
Burnham Center for Chemical Genomics
Curated by PubChem BioAssay
Assay Description
Sanford-Burnham Center for Chemical Genomics (SBCCG) Sanford-Burnham Medical Research Institute (SBMRI, San Diego, CA) NIH Molecular Libraries Screen...
PubChem Bioassay (2010)
BindingDB Entry DOI: 10.7270/Q2CR5RRG