BDBM458203 US10752615, Compound 99
SMILES: C=CC(=O)N1CC[C@@]2(C[C@@H](C2)n2c(NC(=O)c3ccc(s3)-c3ccc(=O)[nH]c3)nc3ccccc23)C1
InChI Key:
Data: 4 IC50
Activity Spreadsheet -- Enzyme Inhibition Constant Data from BindingDB
Found 4 hits for monomerid = 458203
Trg + Lig
Ki
nM
ΔG°
kcal/mole
IC50
nM
Kd
nM
EC50/IC50
nM
koff
s-1
kon
M-1s-1
pHTemp
°C
Tyrosine-protein kinase ITK/TSK
(Homo sapiens (Human))
BDBM458203
(US10752615, Compound 99)
Show SMILES C=CC(=O)N1CC[C@@]2(C[C@@H](C2)n2c(NC(=O)c3ccc(s3)-c3ccc(=O)[nH]c3)nc3ccccc23)C1 |r,wU:9.11,7.10,(-5.49,-6.68,;-5.09,-5.2,;-3.6,-4.8,;-2.51,-5.89,;-3.2,-3.31,;-1.74,-2.84,;-1.74,-1.3,;-3.2,-.82,;-2.43,.51,;-3.77,1.28,;-4.54,-.05,;-4.16,2.77,;-3.26,4.02,;-1.72,4.02,;-.95,5.35,;-1.72,6.68,;.59,5.35,;1.5,6.6,;2.96,6.12,;2.96,4.58,;1.5,4.11,;4.29,3.81,;5.63,4.58,;6.96,3.81,;6.96,2.27,;8.3,1.5,;5.63,1.5,;4.29,2.27,;-4.16,5.26,;-5.63,4.79,;-6.96,5.56,;-8.3,4.79,;-8.3,3.25,;-6.96,2.48,;-5.63,3.25,;-4.11,-2.07,)|
Reactome pathway
US Patent
n/an/a 2.95n/an/an/an/an/an/a
GB005, Inc.
US Patent
Assay Description
The in vitro kinase assays were performed at Nanosyn (Santa Clara, Calif.) utilizing microfluidic detection technology. The test compounds were seria...
US Patent US10752615 (2020)
Tyrosine-protein kinase TEC
(Homo sapiens (Human))
BDBM458203
(US10752615, Compound 99)
Show SMILES C=CC(=O)N1CC[C@@]2(C[C@@H](C2)n2c(NC(=O)c3ccc(s3)-c3ccc(=O)[nH]c3)nc3ccccc23)C1 |r,wU:9.11,7.10,(-5.49,-6.68,;-5.09,-5.2,;-3.6,-4.8,;-2.51,-5.89,;-3.2,-3.31,;-1.74,-2.84,;-1.74,-1.3,;-3.2,-.82,;-2.43,.51,;-3.77,1.28,;-4.54,-.05,;-4.16,2.77,;-3.26,4.02,;-1.72,4.02,;-.95,5.35,;-1.72,6.68,;.59,5.35,;1.5,6.6,;2.96,6.12,;2.96,4.58,;1.5,4.11,;4.29,3.81,;5.63,4.58,;6.96,3.81,;6.96,2.27,;8.3,1.5,;5.63,1.5,;4.29,2.27,;-4.16,5.26,;-5.63,4.79,;-6.96,5.56,;-8.3,4.79,;-8.3,3.25,;-6.96,2.48,;-5.63,3.25,;-4.11,-2.07,)|
Reactome pathway
US Patent
n/an/a 1.27n/an/an/an/an/an/a
GB005, Inc.
US Patent
Assay Description
The in vitro kinase assays were performed at Nanosyn (Santa Clara, Calif.) utilizing microfluidic detection technology. The test compounds were seria...
US Patent US10752615 (2020)
Tyrosine-protein kinase BTK
(Homo sapiens (Human))
BDBM458203
(US10752615, Compound 99)
Show SMILES C=CC(=O)N1CC[C@@]2(C[C@@H](C2)n2c(NC(=O)c3ccc(s3)-c3ccc(=O)[nH]c3)nc3ccccc23)C1 |r,wU:9.11,7.10,(-5.49,-6.68,;-5.09,-5.2,;-3.6,-4.8,;-2.51,-5.89,;-3.2,-3.31,;-1.74,-2.84,;-1.74,-1.3,;-3.2,-.82,;-2.43,.51,;-3.77,1.28,;-4.54,-.05,;-4.16,2.77,;-3.26,4.02,;-1.72,4.02,;-.95,5.35,;-1.72,6.68,;.59,5.35,;1.5,6.6,;2.96,6.12,;2.96,4.58,;1.5,4.11,;4.29,3.81,;5.63,4.58,;6.96,3.81,;6.96,2.27,;8.3,1.5,;5.63,1.5,;4.29,2.27,;-4.16,5.26,;-5.63,4.79,;-6.96,5.56,;-8.3,4.79,;-8.3,3.25,;-6.96,2.48,;-5.63,3.25,;-4.11,-2.07,)|
NCI pathway
Reactome pathway
US Patent
n/an/a 10.2n/an/an/an/an/an/a
GB005, Inc.
US Patent
Assay Description
The in vitro kinase assays were performed at Nanosyn (Santa Clara, Calif.) utilizing microfluidic detection technology. The test compounds were seria...
US Patent US10752615 (2020)
Tyrosine-protein kinase TXK
(Homo sapiens (Human))
BDBM458203
(US10752615, Compound 99)
Show SMILES C=CC(=O)N1CC[C@@]2(C[C@@H](C2)n2c(NC(=O)c3ccc(s3)-c3ccc(=O)[nH]c3)nc3ccccc23)C1 |r,wU:9.11,7.10,(-5.49,-6.68,;-5.09,-5.2,;-3.6,-4.8,;-2.51,-5.89,;-3.2,-3.31,;-1.74,-2.84,;-1.74,-1.3,;-3.2,-.82,;-2.43,.51,;-3.77,1.28,;-4.54,-.05,;-4.16,2.77,;-3.26,4.02,;-1.72,4.02,;-.95,5.35,;-1.72,6.68,;.59,5.35,;1.5,6.6,;2.96,6.12,;2.96,4.58,;1.5,4.11,;4.29,3.81,;5.63,4.58,;6.96,3.81,;6.96,2.27,;8.3,1.5,;5.63,1.5,;4.29,2.27,;-4.16,5.26,;-5.63,4.79,;-6.96,5.56,;-8.3,4.79,;-8.3,3.25,;-6.96,2.48,;-5.63,3.25,;-4.11,-2.07,)|
US Patent
n/an/a 1.01n/an/an/an/an/an/a
GB005, Inc.
US Patent
Assay Description
The in vitro kinase assays were performed at Nanosyn (Santa Clara, Calif.) utilizing microfluidic detection technology. The test compounds were seria...
US Patent US10752615 (2020)