BDBM458235 US10752615, Compound 133
SMILES: C=CC(=O)N1CC[C@@]2(C[C@@H](C2)n2c(NC(=O)c3ccc(s3)-c3ccncn3)nc3ccccc23)C1
InChI Key: InChIKey=FMUGXGTXXNULGS-PJCCXEONSA-N
Data: 4 IC50
Activity Spreadsheet -- Enzyme Inhibition Constant Data from BindingDB
Found 4 hits for monomerid = 458235
Trg + Lig
Ki
nM
ΔG°
kcal/mole
IC50
nM
Kd
nM
EC50/IC50
nM
koff
s-1
kon
M-1s-1
pHTemp
°C
Tyrosine-protein kinase ITK/TSK
(Homo sapiens (Human))
BDBM458235
(US10752615, Compound 133)
Show SMILES C=CC(=O)N1CC[C@@]2(C[C@@H](C2)n2c(NC(=O)c3ccc(s3)-c3ccncn3)nc3ccccc23)C1 |r,wU:9.11,7.10,(-4.82,-6.68,;-4.42,-5.2,;-2.93,-4.8,;-1.84,-5.89,;-2.53,-3.31,;-1.07,-2.84,;-1.07,-1.3,;-2.53,-.82,;-1.76,.51,;-3.1,1.28,;-3.87,-.05,;-3.5,2.77,;-2.59,4.02,;-1.05,4.02,;-.28,5.35,;-1.05,6.68,;1.26,5.35,;2.16,6.6,;3.63,6.12,;3.63,4.58,;2.16,4.11,;4.96,3.81,;4.96,2.27,;6.3,1.5,;7.63,2.27,;7.63,3.81,;6.3,4.58,;-3.5,5.26,;-4.96,4.79,;-6.3,5.56,;-7.63,4.79,;-7.63,3.25,;-6.3,2.48,;-4.96,3.25,;-3.44,-2.07,)|
Show InChI InChI=1S/C26H24N6O2S/c1-2-23(33)31-12-10-26(15-31)13-17(14-26)32-20-6-4-3-5-18(20)29-25(32)30-24(34)22-8-7-21(35-22)19-9-11-27-16-28-19/h2-9,11,16-17H,1,10,12-15H2,(H,29,30,34)/t17-,26-
Reactome pathway
US Patent
n/an/a 1.92n/an/an/an/an/an/a
GB005, Inc.
US Patent
Assay Description
The in vitro kinase assays were performed at Nanosyn (Santa Clara, Calif.) utilizing microfluidic detection technology. The test compounds were seria...
US Patent US10752615 (2020)
Tyrosine-protein kinase TEC
(Homo sapiens (Human))
BDBM458235
(US10752615, Compound 133)
Show SMILES C=CC(=O)N1CC[C@@]2(C[C@@H](C2)n2c(NC(=O)c3ccc(s3)-c3ccncn3)nc3ccccc23)C1 |r,wU:9.11,7.10,(-4.82,-6.68,;-4.42,-5.2,;-2.93,-4.8,;-1.84,-5.89,;-2.53,-3.31,;-1.07,-2.84,;-1.07,-1.3,;-2.53,-.82,;-1.76,.51,;-3.1,1.28,;-3.87,-.05,;-3.5,2.77,;-2.59,4.02,;-1.05,4.02,;-.28,5.35,;-1.05,6.68,;1.26,5.35,;2.16,6.6,;3.63,6.12,;3.63,4.58,;2.16,4.11,;4.96,3.81,;4.96,2.27,;6.3,1.5,;7.63,2.27,;7.63,3.81,;6.3,4.58,;-3.5,5.26,;-4.96,4.79,;-6.3,5.56,;-7.63,4.79,;-7.63,3.25,;-6.3,2.48,;-4.96,3.25,;-3.44,-2.07,)|
Show InChI InChI=1S/C26H24N6O2S/c1-2-23(33)31-12-10-26(15-31)13-17(14-26)32-20-6-4-3-5-18(20)29-25(32)30-24(34)22-8-7-21(35-22)19-9-11-27-16-28-19/h2-9,11,16-17H,1,10,12-15H2,(H,29,30,34)/t17-,26-
Reactome pathway
US Patent
n/an/a 0.280n/an/an/an/an/an/a
GB005, Inc.
US Patent
Assay Description
The in vitro kinase assays were performed at Nanosyn (Santa Clara, Calif.) utilizing microfluidic detection technology. The test compounds were seria...
US Patent US10752615 (2020)
Tyrosine-protein kinase BTK
(Homo sapiens (Human))
BDBM458235
(US10752615, Compound 133)
Show SMILES C=CC(=O)N1CC[C@@]2(C[C@@H](C2)n2c(NC(=O)c3ccc(s3)-c3ccncn3)nc3ccccc23)C1 |r,wU:9.11,7.10,(-4.82,-6.68,;-4.42,-5.2,;-2.93,-4.8,;-1.84,-5.89,;-2.53,-3.31,;-1.07,-2.84,;-1.07,-1.3,;-2.53,-.82,;-1.76,.51,;-3.1,1.28,;-3.87,-.05,;-3.5,2.77,;-2.59,4.02,;-1.05,4.02,;-.28,5.35,;-1.05,6.68,;1.26,5.35,;2.16,6.6,;3.63,6.12,;3.63,4.58,;2.16,4.11,;4.96,3.81,;4.96,2.27,;6.3,1.5,;7.63,2.27,;7.63,3.81,;6.3,4.58,;-3.5,5.26,;-4.96,4.79,;-6.3,5.56,;-7.63,4.79,;-7.63,3.25,;-6.3,2.48,;-4.96,3.25,;-3.44,-2.07,)|
Show InChI InChI=1S/C26H24N6O2S/c1-2-23(33)31-12-10-26(15-31)13-17(14-26)32-20-6-4-3-5-18(20)29-25(32)30-24(34)22-8-7-21(35-22)19-9-11-27-16-28-19/h2-9,11,16-17H,1,10,12-15H2,(H,29,30,34)/t17-,26-
NCI pathway
Reactome pathway
US Patent
n/an/a 3.27n/an/an/an/an/an/a
GB005, Inc.
US Patent
Assay Description
The in vitro kinase assays were performed at Nanosyn (Santa Clara, Calif.) utilizing microfluidic detection technology. The test compounds were seria...
US Patent US10752615 (2020)
Tyrosine-protein kinase TXK
(Homo sapiens (Human))
BDBM458235
(US10752615, Compound 133)
Show SMILES C=CC(=O)N1CC[C@@]2(C[C@@H](C2)n2c(NC(=O)c3ccc(s3)-c3ccncn3)nc3ccccc23)C1 |r,wU:9.11,7.10,(-4.82,-6.68,;-4.42,-5.2,;-2.93,-4.8,;-1.84,-5.89,;-2.53,-3.31,;-1.07,-2.84,;-1.07,-1.3,;-2.53,-.82,;-1.76,.51,;-3.1,1.28,;-3.87,-.05,;-3.5,2.77,;-2.59,4.02,;-1.05,4.02,;-.28,5.35,;-1.05,6.68,;1.26,5.35,;2.16,6.6,;3.63,6.12,;3.63,4.58,;2.16,4.11,;4.96,3.81,;4.96,2.27,;6.3,1.5,;7.63,2.27,;7.63,3.81,;6.3,4.58,;-3.5,5.26,;-4.96,4.79,;-6.3,5.56,;-7.63,4.79,;-7.63,3.25,;-6.3,2.48,;-4.96,3.25,;-3.44,-2.07,)|
Show InChI InChI=1S/C26H24N6O2S/c1-2-23(33)31-12-10-26(15-31)13-17(14-26)32-20-6-4-3-5-18(20)29-25(32)30-24(34)22-8-7-21(35-22)19-9-11-27-16-28-19/h2-9,11,16-17H,1,10,12-15H2,(H,29,30,34)/t17-,26-
US Patent
n/an/a 0.370n/an/an/an/an/an/a
GB005, Inc.
US Patent
Assay Description
The in vitro kinase assays were performed at Nanosyn (Santa Clara, Calif.) utilizing microfluidic detection technology. The test compounds were seria...
US Patent US10752615 (2020)