BDBM4601 (2E)-N-{4-[(3-bromophenyl)amino]quinazolin-6-yl}-3-(morpholin-4-yl)prop-2-enamide::4-anilinoquinazoline deriv. 25h
SMILES: Brc1cccc(Nc2ncnc3ccc(NC(=O)\C=C\N4CCOCC4)cc23)c1
InChI Key: InChIKey=AGTPOONMTANNPL-VOTSOKGWSA-N
Data: 2 IC50
Activity Spreadsheet -- Enzyme Inhibition Constant Data from BindingDB
Found 2 hits for monomerid = 4601
Trg + Lig
Ki
nM
ΔG°
kcal/mole
IC50
nM
Kd
nM
EC50/IC50
nM
koff
s-1
kon
M-1s-1
pHTemp
°C
Receptor tyrosine-protein kinase erbB-2
(Homo sapiens (Human))
BDBM4601
((2E)-N-{4-[(3-bromophenyl)amino]quinazolin-6-yl}-3...)
Show SMILES Brc1cccc(Nc2ncnc3ccc(NC(=O)\C=C\N4CCOCC4)cc23)c1
Show InChI InChI=1S/C21H20BrN5O2/c22-15-2-1-3-16(12-15)26-21-18-13-17(4-5-19(18)23-14-24-21)25-20(28)6-7-27-8-10-29-11-9-27/h1-7,12-14H,8-11H2,(H,25,28)(H,23,24,26)/b7-6+
n/an/a 4.18E+3n/an/an/an/an/an/a
Wyeth-Ayerst Research
Assay Description
The HER-2 kinase autophosphorylation activity was measured by DELFIA/time-resolved fluorometry with excitation at 340 nm and emission at 615 nm. Po...
J Med Chem 44: 2719-34 (2001)
Article DOI: 10.1021/jm0005555
BindingDB Entry DOI: 10.7270/Q2PN93TS
Epidermal growth factor receptor
(Homo sapiens (Human))
BDBM4601
((2E)-N-{4-[(3-bromophenyl)amino]quinazolin-6-yl}-3...)
Show SMILES Brc1cccc(Nc2ncnc3ccc(NC(=O)\C=C\N4CCOCC4)cc23)c1
Show InChI InChI=1S/C21H20BrN5O2/c22-15-2-1-3-16(12-15)26-21-18-13-17(4-5-19(18)23-14-24-21)25-20(28)6-7-27-8-10-29-11-9-27/h1-7,12-14H,8-11H2,(H,25,28)(H,23,24,26)/b7-6+
n/an/a 215n/an/an/an/an/an/a
Wyeth-Ayerst Research
Assay Description
The EGF-R kinase autophosphorylation activity was measured by DELFIA/time-resolved fluorometry with excitation at 340 nm and emission at 615 nm. Po...
J Med Chem 44: 2719-34 (2001)
Article DOI: 10.1021/jm0005555
BindingDB Entry DOI: 10.7270/Q2PN93TS