null
SMILES: CCNC(=O)Nc1nc2cc(N)ncc2cc1-c1ccccc1
InChI Key: InChIKey=GJXAKRCIKXUHFB-UHFFFAOYSA-N
Activity Spreadsheet -- Enzyme Inhibition Constant Data from BindingDB
Found 3 hits for monomerid = 4605
Trg + Lig
Ki
nM
ΔG°
kcal/mole
IC50
nM
Kd
nM
EC50/IC50
nM
koff
s-1
kon
M-1s-1
pHTemp
°C
Fibroblast growth factor receptor 1
(Homo sapiens (Human))
BDBM4605
(1,6-naphthyridine deriv. 7 | 1-(7-amino-3-phenyl-1...)
Show SMILES CCNC(=O)Nc1nc2cc(N)ncc2cc1-c1ccccc1
Show InChI InChI=1S/C17H17N5O/c1-2-19-17(23)22-16-13(11-6-4-3-5-7-11)8-12-10-20-15(18)9-14(12)21-16/h3-10H,2H2,1H3,(H2,18,20)(H2,19,21,22,23)
NCI pathway
Reactome pathway
n/an/a 1.30E+3n/an/an/an/a7.425
University of Auckland
Assay Description
IC50 is the inhibitor concentration which inhibits 50% of kinase activity that catalyzes the transfer of the terminal phosphate from [gamma-32P] labe...
J Med Chem 43: 4200-11 (2000)
Article DOI: 10.1021/jm000161d
BindingDB Entry DOI: 10.7270/Q2JW8C3G
Proto-oncogene tyrosine-protein kinase Src
(Homo sapiens (Human))
BDBM4605
(1,6-naphthyridine deriv. 7 | 1-(7-amino-3-phenyl-1...)
Show SMILES CCNC(=O)Nc1nc2cc(N)ncc2cc1-c1ccccc1
Show InChI InChI=1S/C17H17N5O/c1-2-19-17(23)22-16-13(11-6-4-3-5-7-11)8-12-10-20-15(18)9-14(12)21-16/h3-10H,2H2,1H3,(H2,18,20)(H2,19,21,22,23)
n/an/a 5.10E+3n/an/an/an/an/an/a
University of Auckland
Assay Description
IC50 is the inhibitor concentration which inhibits 50% of kinase activity that catalyzes the transfer of the terminal phosphate from [gamma-32P] labe...
J Med Chem 43: 4200-11 (2000)
Article DOI: 10.1021/jm000161d
BindingDB Entry DOI: 10.7270/Q2JW8C3G
Platelet-derived growth factor receptor beta
(Homo sapiens (Human))
BDBM4605
(1,6-naphthyridine deriv. 7 | 1-(7-amino-3-phenyl-1...)
Show SMILES CCNC(=O)Nc1nc2cc(N)ncc2cc1-c1ccccc1
Show InChI InChI=1S/C17H17N5O/c1-2-19-17(23)22-16-13(11-6-4-3-5-7-11)8-12-10-20-15(18)9-14(12)21-16/h3-10H,2H2,1H3,(H2,18,20)(H2,19,21,22,23)
NCI pathway
Reactome pathway
n/an/a 7.70E+3n/an/an/an/a7.425
University of Auckland
Assay Description
IC50 is the inhibitor concentration which inhibits 50% of kinase activity that catalyzes the transfer of the terminal phosphate from [gamma-32P] labe...
J Med Chem 43: 4200-11 (2000)
Article DOI: 10.1021/jm000161d
BindingDB Entry DOI: 10.7270/Q2JW8C3G