BDBM46295 4-(2-methyl-3-imidazo[1,2-a]pyrimidinyl)-N-(4-methylphenyl)-2-thiazolamine::4-(2-methylimidazo[1,2-a]pyrimidin-3-yl)-N-(4-methylphenyl)-1,3-thiazol-2-amine::MLS000553283::SMR000177865::[4-(2-Methyl-imidazo[1,2-a]pyrimidin-3-yl)-thiazol-2-yl]-p-tolyl-amine::[4-(2-methylimidazo[1,2-a]pyrimidin-3-yl)thiazol-2-yl]-(p-tolyl)amine::cid_2898055
SMILES: Cc1nc2ncccn2c1-c1csc(Nc2ccc(C)cc2)n1
InChI Key: InChIKey=HLHPYEQIFQNYFU-UHFFFAOYSA-N
Data: 2 EC50
Activity Spreadsheet -- Enzyme Inhibition Constant Data from BindingDB
Found 2 hits for monomerid = 46295
Trg + Lig
Ki
nM
ΔG°
kcal/mole
IC50
nM
Kd
nM
EC50/IC50
nM
koff
s-1
kon
M-1s-1
pHTemp
°C
glutathione S-transferase
(Homo sapiens (Human))
BDBM46295
(4-(2-methyl-3-imidazo[1,2-a]pyrimidinyl)-N-(4-meth...)
Show SMILES Cc1nc2ncccn2c1-c1csc(Nc2ccc(C)cc2)n1
Show InChI InChI=1S/C17H15N5S/c1-11-4-6-13(7-5-11)20-17-21-14(10-23-17)15-12(2)19-16-18-8-3-9-22(15)16/h3-10H,1-2H3,(H,20,21)
NCI pathway
Reactome pathway
PCBioAssay
n/an/an/an/a 3.48E+4n/an/an/an/a
NMMLSC
Curated by PubChem BioAssay
Assay Description
University of New Mexico Assay Overview: Assay Support: NIH I RO3 MH081231-01 HTS to identify specific small molecule inhibitors of Ras and Ras-re...
PubChem Bioassay (2010)
BindingDB Entry DOI: 10.7270/Q2ZC8184
glutathione S-transferase
(Homo sapiens (Human))
BDBM46295
(4-(2-methyl-3-imidazo[1,2-a]pyrimidinyl)-N-(4-meth...)
Show SMILES Cc1nc2ncccn2c1-c1csc(Nc2ccc(C)cc2)n1
Show InChI InChI=1S/C17H15N5S/c1-11-4-6-13(7-5-11)20-17-21-14(10-23-17)15-12(2)19-16-18-8-3-9-22(15)16/h3-10H,1-2H3,(H,20,21)
NCI pathway
Reactome pathway
PCBioAssay
n/an/an/an/a 1.84E+4n/an/an/an/a
NMMLSC
Curated by PubChem BioAssay
Assay Description
University of New Mexico Assay Overview: Assay Support: NIH 1X01 MH079850-01 HTS to identify small molecule regulators of Bcl-2 family protein int...
PubChem Bioassay (2008)
BindingDB Entry DOI: 10.7270/Q2M61HPT