BDBM4633 2-chloro-4-fluoro-5-{[6-methoxy-7-(2-methoxyethoxy)quinolin-4-yl]amino}phenol::Anilinoquinoline deriv. 16::N-(4-Chloro-2-fluoro-5-hydroxyphenyl)-6-methoxy-7-(2-methoxyethoxy)-4-quinolinylamine hydrochloride
SMILES: COCCOc1cc2nccc(Nc3cc(O)c(Cl)cc3F)c2cc1OC
InChI Key: InChIKey=QGRWLEOULVUBBC-UHFFFAOYSA-N
Data: 3 IC50
Activity Spreadsheet -- Enzyme Inhibition Constant Data from BindingDB
Found 3 hits for monomerid = 4633
Trg + Lig
Ki
nM
ΔG°
kcal/mole
IC50
nM
Kd
nM
EC50/IC50
nM
koff
s-1
kon
M-1s-1
pHTemp
°C
Vascular endothelial growth factor receptor 1
(Homo sapiens (Human))
BDBM4633
(2-chloro-4-fluoro-5-{[6-methoxy-7-(2-methoxyethoxy...)
Show SMILES COCCOc1cc2nccc(Nc3cc(O)c(Cl)cc3F)c2cc1OC
Show InChI InChI=1S/C19H18ClFN2O4/c1-25-5-6-27-19-10-15-11(7-18(19)26-2)14(3-4-22-15)23-16-9-17(24)12(20)8-13(16)21/h3-4,7-10,24H,5-6H2,1-2H3,(H,22,23)
n/an/a 3n/an/an/an/a7.422
AstraZeneca
Assay Description
An ELISA assay was used to determine the ability of inhibitor to inhibit VEGF-R RTK activity. The compounds were incubated with enzyme 20 min at room...
J Med Chem 42: 5369-89 (1999)
Article DOI: 10.1021/jm990345w
BindingDB Entry DOI: 10.7270/Q2F47MBM
Fibroblast growth factor receptor 1
(Homo sapiens (Human))
BDBM4633
(2-chloro-4-fluoro-5-{[6-methoxy-7-(2-methoxyethoxy...)
Show SMILES COCCOc1cc2nccc(Nc3cc(O)c(Cl)cc3F)c2cc1OC
Show InChI InChI=1S/C19H18ClFN2O4/c1-25-5-6-27-19-10-15-11(7-18(19)26-2)14(3-4-22-15)23-16-9-17(24)12(20)8-13(16)21/h3-4,7-10,24H,5-6H2,1-2H3,(H,22,23)
NCI pathway
Reactome pathway
n/an/a 1.40E+3n/an/an/an/an/a25
AstraZeneca
Assay Description
An ELISA assay was used to determine the ability of inhibitor to inhibit FGFR-1 TK activity. The compounds were incubated with enzyme 20 min at room ...
J Med Chem 42: 5369-89 (1999)
Article DOI: 10.1021/jm990345w
BindingDB Entry DOI: 10.7270/Q2F47MBM
Vascular endothelial growth factor receptor 2
(Homo sapiens (Human))
BDBM4633
(2-chloro-4-fluoro-5-{[6-methoxy-7-(2-methoxyethoxy...)
Show SMILES COCCOc1cc2nccc(Nc3cc(O)c(Cl)cc3F)c2cc1OC
Show InChI InChI=1S/C19H18ClFN2O4/c1-25-5-6-27-19-10-15-11(7-18(19)26-2)14(3-4-22-15)23-16-9-17(24)12(20)8-13(16)21/h3-4,7-10,24H,5-6H2,1-2H3,(H,22,23)
NCI pathway
Reactome pathway
n/an/a<2n/an/an/an/an/a25
AstraZeneca
Assay Description
An ELISA assay was used to determine the ability of inhibitor to inhibit VEGF-R RTK activity. The compounds were incubated with enzyme 20 min at room...
J Med Chem 42: 5369-89 (1999)
Article DOI: 10.1021/jm990345w
BindingDB Entry DOI: 10.7270/Q2F47MBM