BDBM46459 MLS000534872::N-cyclopentyl-2-[(5-methyl-1,3,4-thiadiazol-2-yl)sulfanyl]acetamide::N-cyclopentyl-2-[(5-methyl-1,3,4-thiadiazol-2-yl)sulfanyl]ethanamide::N-cyclopentyl-2-[(5-methyl-1,3,4-thiadiazol-2-yl)thio]acetamide::SMR000142307::cid_895382
SMILES: Cc1nnc(SCC(=O)NC2CCCC2)s1
InChI Key: InChIKey=WOEWVUCFBKRTEM-UHFFFAOYSA-N
Data: 2 EC50
Activity Spreadsheet -- Enzyme Inhibition Constant Data from BindingDB
Found 2 hits for monomerid = 46459
Trg + Lig
Ki
nM
ΔG°
kcal/mole
IC50
nM
Kd
nM
EC50/IC50
nM
koff
s-1
kon
M-1s-1
pHTemp
°C
Eukaryotic translation initiation factor 2-alpha kinase 3
(Homo sapiens (Human))
BDBM46459
(MLS000534872 | N-cyclopentyl-2-[(5-methyl-1,3,4-th...)
Show SMILES Cc1nnc(SCC(=O)NC2CCCC2)s1
Show InChI InChI=1S/C10H15N3OS2/c1-7-12-13-10(16-7)15-6-9(14)11-8-4-2-3-5-8/h8H,2-6H2,1H3,(H,11,14)
PCBioAssay
n/an/an/an/a>5.57E+4n/an/an/an/a
The Scripps Research Institute Molecular Screening Center
Curated by PubChem BioAssay
Assay Description
Source (MLPCN Center Name): The Scripps Research Institute Molecular Screening Center (SRIMSC) Center Affiliation: The Scripps Research Institute (TS...
PubChem Bioassay (2009)
BindingDB Entry DOI: 10.7270/Q2SQ8XTZ
Eukaryotic translation initiation factor 2-alpha kinase 3
(Homo sapiens (Human))
BDBM46459
(MLS000534872 | N-cyclopentyl-2-[(5-methyl-1,3,4-th...)
Show SMILES Cc1nnc(SCC(=O)NC2CCCC2)s1
Show InChI InChI=1S/C10H15N3OS2/c1-7-12-13-10(16-7)15-6-9(14)11-8-4-2-3-5-8/h8H,2-6H2,1H3,(H,11,14)
PCBioAssay
n/an/an/an/a>5.57E+4n/an/an/an/a
The Scripps Research Institute Molecular Screening Center
Curated by PubChem BioAssay
Assay Description
Source (MLPCN Center Name): The Scripps Research Institute Molecular Screening Center (SRIMSC) Center Affiliation: The Scripps Research Institute (TS...
PubChem Bioassay (2009)
BindingDB Entry DOI: 10.7270/Q2XG9PJP